{"text_format":"1","workbook":"xlsx","n_sheets":6,"sheets":["Facility Data","Facility Info.","Facility Cover Sheet","Weighted","Tally Sheet","US. Speed Sheet"],"not_rendered":{"charts":0,"images":0,"macros":1,"external_links":0,"defined_names":35,"comments":0,"pivot_tables":0},"unopened":[],"bounds":{"document_bytes":16777216,"sheet_cells":100000,"rows_first":2000,"rows_last":500,"rows_between":2000,"halvings":0,"cell_chars":16384,"cell_head_chars":4096},"cells_cut":0,"cells_raw":0,"read":"whole","date_system":"1900"}

{"sheet":"Facility Data","index":0,"n_rows":153,"n_cols":6,"rows_kept":153,"cut":false,"hidden":true,"merged":[]}
[null,null,null,"CONTRACTOR LIST"]
[]
["Staff",null,null,"AA"]
[" ",null,null,"AMERICAN AUTO WORKS"]
[" ",null,null,"AMPORTS"]
["PB",null,null,"APLS"]
["DH",null,null,"ATC LOGISTICS"]
["CM",null,null,"AUTO RELEASING INC."]
["PB, DH, CM",null,null,"AUTO WAREHOUSING CO"]
["PB, DH ",null,null,"AUTOPORT LTD."]
["PB, CM",null,null,"AUTOPORT LTD. & PAWLAN HOLDINGS LTD."]
["DH, CM",null,null,"AUTORAMP SERVICES"]
["Railroad Abrivations",null,null,"CAN-AUTO"]
[" ",null,null,"CARLOGISTICS"]
["AA",null,null,"CARS"]
["BNSF",null,null,"CASSENS"]
["CIND",null,null,"CEVA LOGISTICS"]
["CISD",null,null,"CN"]
["CONRAIL SHARED ASSETS",null,null,"COMPLETE AUTO NETWORK"]
["CN",null,null,"CONRAIL SHARED ASSETS"]
["CP",null,null,"CP"]
["CSX",null,null,"CSX"]
["FERRO MEX",null,null,"D & L AUTO SERVICES"]
["FNM",null,null,"DISTRIBUTION AUTO SERVICES"]
["IC",null,null,"FAPS"]
["KCS",null,null,"FORD UAW"]
["NS",null,null,"FRASER WHARVES LTD."]
["PTRA",null,null,"GAPS"]
["SRY",null,null,"GEN-AUTO SHIPPERS"]
["TFM",null,null,"GM UAW"]
["TMBL",null,null,"HYUNDAI GLOVIS"]
["UP",null,null,"INTERNATIONAL AUTO PROCESSING"]
[" ",null,null,"INTER-RAIL "]
[1,null,null,"IN-TERMINAL SERVICES"]
[2,null,null,"JACK COOPER TRANSPORT"]
[3,null,null,"KENOSHA RELEASING INC"]
[" ",null,null,"L. HANSEN'S FORWARDING LTD."]
[" ",null,null,"LORDSTOWN OF OHIO LLC"]
["Yes ",null,null,"MARION INDUSTRIAL CENTER"]
["No",null,null,"MID TEXAS INTERNATIONAL"]
[null,null,null,"MIS"]
[null,null,null,"MULTI-LEVEL SERVICES"]
[null,null,null,"MVP"]
[null,null,null,"NORTH AMERICAN RAIL SOLUTIONS"]
[null,null,null,"NORTHEAST VEHICLE SERVICE"]
[null,null,null,"PASHA"]
[null,null,null,"PHL"]
[null,null,null,"PREMIER"]
[null,null,null,"PRECISION VEHICLE LOGISTICS"]
[null,null,null,"PRS AUTO"]
[null,null,null,"RCS TRANSPORTATION"]
[null,null,null,"RJ CORMAN"]
[null,null,null,"ROAD & RAIL SERVICES"]
[null,null,null,"RYDER"]
[null,null,null,"SOUTHEAST TOYOTA DISTRIBUTORS"]
[null,null,null,"SPD-1 LOGISTICS"]
[null,null,null,"STARPORT SERVICES INC"]
[null,null,null,"T & S SERVICES"]
[null,null,null,"T.V. MINORITY COMPANY INC"]
[null,null,null,"TMM LOGISTICS"]
[null,null,null,"TNT LOGISTICS"]
[null,null,null,"TOYOTA LOGISTICS SERVICES"]
[null,null,null,"TOYOTA MOTOR MANUFACTURING"]
[null,null,null,"TRANS CARGO LLC."]
[null,null,null,"TRANSPORT SUPPORT"]
[null,null,null,"TURNING BASIN SERVICES"]
[null,null,null,"SPD-1 LOGISTICS"]
[null,null,null,"SRY"]
[null,null,null,"T & S SERVICES"]
[null,null,null,"T.V. MINORITY COMPANY INC"]
[null,null,null,"TCB"]
[null,null,null,"TFM"]
[null,null,null,"TMM LOGISTICS"]
[null,null,null,"TNT LOGISTICS"]
[null,null,null,"TOYOTA LOGISTICS SERVICES"]
[null,null,null,"TOYOTA MOTOR MANUFACTURING"]
[null,null,null,"TRANSPORT SUPPORT"]
[null,null,null,"TTX"]
[null,null,null,"TURNING BASIN SERVICES"]
[null,null,null,"UP"]
[null,null,null,"UNITED SPECIALITY AUTOMOTIVE"]
[null,null,null,"VASCOR"]
[null,null,null,"WALLENIUS WILHELMSEN LOGISTICS"]
[null,null,null,"Mechanical Contractor"]
[null,null,null," "]
[null,null,null,"AA"]
[null,null,null,"AUTO WAREHOUSING CO"]
[null,null,null,"AUTOPORT"]
[null,null,null,"BNSF"]
[null,null,null,"BNSF, AWC"]
[null,null,null,"CIND"]
[null,null,null,"CISD"]
[null,null,null,"CN"]
[null,null,null,"CP"]
[null,null,null,"CONRAIL SHARED ASSETS"]
[null,null,null,"CSX"]
[null,null,null,"DISTRIBUTION AUTO SERVICES"]
[null,null,null,"EAST BROOKFIELD SPENCER RAILROAD"]
[null,null,null,"FAPS"]
[null,null,null,"FERRO MEX"]
[null,null,null,"FEC"]
[null,null,null,"FRASER WHARVES LTD."]
[null,null,null,"GITR"]
[null,null,null,"HARBOR SERVICES"]
[null,null,null,"IC",null," "]
[null,null,null,"IMEX",null," "]
[null,null,null,"INTERNATIONAL AUTO PROCESSING"]
[null,null,null,"INTER-RAIL ",null," "]
[null,null,null,"ITS"]
[null,null,null,"JACK COOPER TRANSPORT"]
[null,null,null,"KCS",null," "]
[null,null,null,"L. HANSEN'S FORWARDING LTD."]
[null,null,null,"MID TEXAS INTERNATIONAL"]
[null,null,null,"MIS"]
[null,null,null,"MVP",null," "]
[null,null,null,"NORTH AMERICAN RAIL SOLUTIONS"]
[null,null,null,"NORTHEAST VEHICLE SERVICE"]
[null,null,null,"NS",null," "]
[null,null,null,"PASHA",null," "]
[null,null,null,"PHL"]
[null,null,null,"PROGRESS RAIL SERVICES",null," "]
[null,null,null,"PROGRESS SERVICIOS FERROVIARIOS"]
[null,null,null,"PRS AUTO"]
[null,null,null,"PTRA"]
[null,null,null,"QUALITY TERMINAL SERVICES"]
[null,null,null,"RCS TRANSPORTATION"]
[null,null,null,"ROAD & RAIL SERVICES"]
[null,null,null,"RYDER"]
[null,null,null,"SOUTHEAST TOYOTA DISTRIBUTORS"]
[null,null,null,"SRY"]
[null,null,null,"TFM"]
[null,null,null,"TMBL"]
[null,null,null,"TMM LOGISTICS"]
[null,null,null,"TOYOTA LOGISTICS SERVICES"]
[null,null,null,"TOYOTA MOTOR MANUFACTURING"]
[null,null,null,"TNT LOGISTICS"]
[null,null,null,"TTX",null," "]
[null,null,null,"UP"]
[null,null,null,"WALLENIUS WILHELMSEN LOGISTICS"]
[null,null,null," "]
[null,null,null,null,null," "]
[null,null,null,null,null," "]
[null,null,null,null,null," "]
[]
[]
[null,null,null,null,null," "]
[null,null,null,null,null," "]
[null,null,null,null,null," "]
[null,null,null,null,null," "]
[null,null,null,null,null," "]
[null,null,null,null,null," "]
[null,null,null,null,null," "]
[null,null,null,null,null," "]

{"sheet":"Facility Info.","index":1,"n_rows":18,"n_cols":1,"rows_kept":18,"cut":false,"hidden":false,"merged":[[0,0,3,1]]}
["2023 Facility Information Sheet "]
[]
[]
[]
["Date Quality Review Was Completed:"]
["City:"]
["State or Country:"]
["Manufacturers:"]
["Contractor Name:"]
["Cover Sheet Railroad  Abbreviation:"]
["Railroad Responsible For Spotting:"]
["Contractor Responsible For Spotting:"]
["Number of Personnel Trained"]
["Staff Conducting QR Initials"]
["Hotel Info:"]
["Directions:"]
["Best Time to Start Audit and why:"]
["General Notes:"]

{"sheet":"Facility Cover Sheet","index":2,"n_rows":50,"n_cols":10,"rows_kept":50,"cut":false,"hidden":false,"merged":[[6,0,7,2],[6,3,7,5],[6,8,7,9],[0,0,0,9],[1,0,1,3],[2,2,3,5],[2,7,3,9],[4,2,5,5],[4,8,5,8],[9,1,9,4],[11,1,11,4],[58,0,58,1],[59,0,59,1],[13,1,13,4],[19,1,19,5],[54,0,54,1],[55,0,55,1],[56,0,56,1],[57,0,57,1]]}
["AAR DESTINATION QUALITY REVIEW"]
["FACILITY SCORE",null,null,null,{"$f":"(A10*0.18)+(A20*0.15)+(A38*0.35)+(G22*0.2)+(G36*0.12)","v":{"$error":"#DIV/0!"}}]
["Location:",null,null,null,null,null,"Date:",{"$f":"('Facility Info.'!B5)","v":"00:00:00"}]
[]
["Railroad:",null,null,null,null,null,"Ramp Code:"]
[]
["Manufacturer:",null,null,null,null,null,"Contractor:"]
[]
[]
[{"$f":"Weighted!D4","v":{"$error":"#DIV/0!"}},"A. MULTI-LEVEL PLACEMENT - Weight 18%",null,null,null,null,{"$f":"TRUNC(('Tally Sheet'!BA33),4)","v":{"$error":"#DIV/0!"}}," 6. Multi-Level Speeds",null,"A"]
[]
[{"$f":"TRUNC(('Tally Sheet'!A17),4)","v":{"$error":"#DIV/0!"}}," 1. Deck Heights Equal",null,null,null,"A",{"$f":"TRUNC(('Tally Sheet'!BI33),4)","v":{"$error":"#DIV/0!"}}," 7. Ramp/Storage Area Speeds",null,"A"]
[]
[{"$f":"TRUNC(('Tally Sheet'!H17),4)","v":{"$error":"#DIV/0!"}}," 2. Couplers in Proper Position",null,null,null,"A",{"$f":"TRUNC(('Tally Sheet'!BP33),4)","v":{"$error":"#DIV/0!"}}," 8. No Vehicle Shuttling",null,"C"]
[]
[{"$f":"TRUNC(('Tally Sheet'!P17),4)","v":{"$error":"#DIV/0!"}}," 3. Proper Hand Brakes Set",null,null,null,"A",{"$f":"TRUNC(('Tally Sheet'!A49),4)","v":{"$error":"#DIV/0!"}},"9. No Cell Phones/Texting/Mp3/Lounging/Smoking",null,"B"]
[]
[{"$f":"TRUNC(('Tally Sheet'!W17),4)","v":{"$error":"#DIV/0!"}}," 4. Is Track Protection Used",null,null,null,"A",{"$f":"TRUNC(('Tally Sheet'!H49),4)","v":{"$error":"#DIV/0!"}},"10. Ramps, B/Plates & Obstructions Properly Positioned",null,"A"]
[]
[{"$f":"Weighted!D14","v":{"$error":"#DIV/0!"}},"B. END DRS./DECKS/BRIDGE PLATES - Weight 15%",null,null,null,null,{"$f":"TRUNC(('Tally Sheet'!P49),4)","v":{"$error":"#DIV/0!"}},"11. Are Vehicles Shut Off When Unattended",null,"A"]
[]
[{"$f":"TRUNC(('Tally Sheet'!AE17),4)","v":{"$error":"#DIV/0!"}}," 1. End Doors Opened and Stored",null,null,null,"A",{"$f":"Weighted!H14","v":{"$error":"#DIV/0!"}},"D. BAYING PROCEDURES - Weight 20%"]
[]
[{"$f":"TRUNC(('Tally Sheet'!AL17),4)","v":{"$error":"#DIV/0!"}}," 2. Proper Bridge Plates Used at Junctions",null,null,null,"A",{"$f":"TRUNC(('Tally Sheet'!W49),4)","v":{"$error":"#DIV/0!"}},"  1. Obey Posted Traffic Regs. Observe Safe Drv.",null,"A"]
[]
[{"$f":"TRUNC(('Tally Sheet'!AT17),4)","v":{"$error":"#DIV/0!"}}," 3. Bridge Plates Hinged at Higher Deck",null,null,null,"A",{"$f":"TRUNC(('Tally Sheet'!AE49),4)","v":{"$error":"#DIV/0!"}},"  2. One Car Length Maintained Between Vehicles",null,"C"]
[]
[{"$f":"TRUNC(('Tally Sheet'!BA17),4)","v":{"$error":"#DIV/0!"}}," 4. Decks Raised and Locked Prior to Unloading",null,null,null,"A",{"$f":"TRUNC(('Tally Sheet'!AL49),4)","v":{"$error":"#DIV/0!"}},"  3. Seat/Floor Protection in Place",null,"B"]
[]
[{"$f":"TRUNC(('Tally Sheet'!BI17),4)","v":{"$error":"#DIV/0!"}}," 5. Decks Lowered and Locked by Hand",null,null,null,"B",{"$f":"TRUNC(('Tally Sheet'!AT49),4)","v":{"$error":"#DIV/0!"}},"  4. Tires on Line",null,"B"]
[]
[{"$f":"TRUNC(('Tally Sheet'!BP17),4)","v":{"$error":"#DIV/0!"}}," 6. Bridge Plates Lowered Down ",null,null,null,"C",{"$f":"TRUNC(('Tally Sheet'!BA49),4)","v":{"$error":"#DIV/0!"}},"  5. Bumper Interspacing 10\"",null,"C"]
[]
[{"$f":"TRUNC(('Tally Sheet'!A33),4)","v":{"$error":"#DIV/0!"}}," 7. End Doors Closed and Locked",null,null,null,"B",{"$f":"TRUNC(('Tally Sheet'!BI49),4)","v":{"$error":"#DIV/0!"}}," 6. Windows, Doors, etc. Closed",null,"A"]
[]
[{"$f":"TRUNC(('Tally Sheet'!H33),4)","v":{"$error":"#DIV/0!"}}," 8. Bridge Plate Condition/Meet Standards",null,null,null,"A",{"$f":"Weighted!H28","v":{"$error":"#DIV/0!"}},"E. FACILITY PROCEDURES/CONDITIONS - Weight 12%"]
[]
[{"$f":"Weighted!D32","v":{"$error":"#DIV/0!"}},"C. UNLOADING PROCEDURES - Weight 35%",null,null,null,null,{"$f":"TRUNC(('Tally Sheet'!A65),4)","v":{"$error":"#DIV/0!"}},"  1. Vehicle Security Inspection-Upon Exit",null,"C"]
[]
[{"$f":"TRUNC(('Tally Sheet'!P33),4)","v":{"$error":"#DIV/0!"}}," 1. Chocks/Harnesses Properly Stored",null,null,null,"B",{"$f":"TRUNC(('Tally Sheet'!H65),4)","v":{"$error":"#DIV/0!"}},"  2. Gates Closed and Locked When Not in Use",null,"C"]
[]
[{"$f":"TRUNC(('Tally Sheet'!W33),4)","v":{"$error":"#DIV/0!"}}," 2. No Start Vehicles Unloaded Properly",null,null,null,"C",{"$f":"TRUNC(('Tally Sheet'!P65),4)","v":{"$error":"#DIV/0!"}},"  3. Pavement Condition",null,"B"]
[]
[{"$f":"TRUNC(('Tally Sheet'!AE33),4)","v":{"$error":"#DIV/0!"}}," 3. Clothing Condition",null,null,null,"A",{"$f":"TRUNC(('Tally Sheet'!W65),4)","v":{"$error":"#DIV/0!"}},"  4. Storage Area Clean",null,"B"]
[]
[{"$f":"TRUNC(('Tally Sheet'!AL33),4)","v":{"$error":"#DIV/0!"}}," 4. Avoid Touching Vehicles",null,null,null,"A",{"$f":"TRUNC(('Tally Sheet'!AE65),4)","v":{"$error":"#DIV/0!"}},"  5. Unloading Ramp Condition",null,"A"]
[]
[{"$f":"TRUNC(('Tally Sheet'!AT33),4)","v":{"$error":"#DIV/0!"}}," 5. Door Opening Careful",null,null,null,"A",{"$f":"TRUNC(('Tally Sheet'!AL65),4)","v":{"$error":"#DIV/0!"}},"  6. All Tools Covered",null,"A"]
[]
[null,null,null,null,null,null,{"$f":"TRUNC(('Tally Sheet'!AT65),4)","v":{"$error":"#DIV/0!"}},"  7. Is AAR/TTCI Website used for Training Purposes",null,"C"]

{"sheet":"Weighted","index":3,"n_rows":44,"n_cols":8,"rows_kept":44,"cut":false,"hidden":true,"merged":[]}
[]
[null,"Weight","Possible","Wted Score",null,"Weight","Possible","Wted Score"]
[]
["A. MULTI-LEVEL PLACEMENT",null,{"$f":"SUM(C5:C12)","v":{"$error":"#DIV/0!"}},{"$f":"SUM(D5:D10,D11:D12)/C4","v":{"$error":"#DIV/0!"}}," 7. Ramp/Storage Area Speeds",3,{"$f":"IF(H4=\"N/A\",\"N/A\",1*F4)","v":{"$error":"#DIV/0!"}},{"$f":"IF('Facility Cover Sheet'!G12=\"N/A\",\"N/A\",'Facility Cover Sheet'!G12*F4)","v":{"$error":"#DIV/0!"}}]
[]
[" 1. Deck Heights Equal",3,{"$f":"IF(D6=\"N/A\",\"N/A\",1*B6)","v":{"$error":"#DIV/0!"}},{"$f":"IF('Facility Cover Sheet'!A12=\"N/A\",\"N/A\",'Facility Cover Sheet'!A12*B6)","v":{"$error":"#DIV/0!"}}," 8. No Vehicle Shuttling",1,{"$f":"IF(H6=\"N/A\",\"N/A\",1*F6)","v":{"$error":"#DIV/0!"}},{"$f":"IF('Facility Cover Sheet'!G14=\"N/A\",\"N/A\",'Facility Cover Sheet'!G14*F6)","v":{"$error":"#DIV/0!"}}]
[]
[" 2. Couplers in Proper Position",3,{"$f":"IF(D8=\"N/A\",\"N/A\",1*B8)","v":{"$error":"#DIV/0!"}},{"$f":"IF('Facility Cover Sheet'!A14=\"N/A\",\"N/A\",'Facility Cover Sheet'!A14*B8)","v":{"$error":"#DIV/0!"}},"9. No Cell Phones/Texting/Mp3/Lounging/Smoking",2,{"$f":"IF(H8=\"N/A\",\"N/A\",1*F8)","v":{"$error":"#DIV/0!"}},{"$f":"IF('Facility Cover Sheet'!G16=\"N/A\",\"N/A\",'Facility Cover Sheet'!G16*F8)","v":{"$error":"#DIV/0!"}}]
[]
[" 3. Proper Hand Brakes Set",3,{"$f":"IF(D10=\"N/A\",\"N/A\",1*B10)","v":{"$error":"#DIV/0!"}},{"$f":"IF('Facility Cover Sheet'!A16=\"N/A\",\"N/A\",'Facility Cover Sheet'!A16*B10)","v":{"$error":"#DIV/0!"}},"10. Ramps, B/Plates & Obstructions Properly Positioned",3,{"$f":"IF(H10=\"N/A\",\"N/A\",1*F10)","v":{"$error":"#DIV/0!"}},{"$f":"IF('Facility Cover Sheet'!G18=\"N/A\",\"N/A\",'Facility Cover Sheet'!G18*F10)","v":{"$error":"#DIV/0!"}}]
[]
[" 4. Is Track Protection Used",3,{"$f":"IF(D12=\"N/A\",\"N/A\",1*B12)","v":{"$error":"#DIV/0!"}},{"$f":"IF('Facility Cover Sheet'!A18=\"N/A\",\"N/A\",'Facility Cover Sheet'!A18*B12)","v":{"$error":"#DIV/0!"}},"11. Are Vehicles Shut Off When Unattended",3,{"$f":"IF(H12=\"N/A\",\"N/A\",1*F12)","v":{"$error":"#DIV/0!"}},{"$f":"IF('Facility Cover Sheet'!G20=\"N/A\",\"N/A\",'Facility Cover Sheet'!G20*F12)","v":{"$error":"#DIV/0!"}}]
[]
["B. END DOORS/DECKS/BRIDGE PLATES",null,{"$f":"SUM(C15:C30)","v":{"$error":"#DIV/0!"}},{"$f":"SUM(D15:D30)/C14","v":{"$error":"#DIV/0!"}},"D. BAYING PROCEDURES",null,{"$f":"SUM(G15:G26)","v":{"$error":"#DIV/0!"}},{"$f":"SUM(H15:H26)/G14","v":{"$error":"#DIV/0!"}}]
[]
[" 1. End Doors Opened and Stored",3,{"$f":"IF(D16=\"N/A\",\"N/A\",1*B16)","v":{"$error":"#DIV/0!"}},{"$f":"IF('Facility Cover Sheet'!A22=\"N/A\",\"N/A\",'Facility Cover Sheet'!A22*B16)","v":{"$error":"#DIV/0!"}},"  1. Obey Posted Traffic Regs. Observe Safe Drv.",3,{"$f":"IF(H16=\"N/A\",\"N/A\",1*F16)","v":{"$error":"#DIV/0!"}},{"$f":"IF('Facility Cover Sheet'!G24=\"N/A\",\"N/A\",'Facility Cover Sheet'!G24*F16)","v":{"$error":"#DIV/0!"}}]
[]
[" 2. Proper Bridge Plates Used at Junctions",3,{"$f":"IF(D18=\"N/A\",\"N/A\",1*B18)","v":{"$error":"#DIV/0!"}},{"$f":"IF('Facility Cover Sheet'!A24=\"N/A\",\"N/A\",'Facility Cover Sheet'!A24*B18)","v":{"$error":"#DIV/0!"}},"  2. One Car Length Maintained Between Vehicles",1,{"$f":"IF(H18=\"N/A\",\"N/A\",1*F18)","v":{"$error":"#DIV/0!"}},{"$f":"IF('Facility Cover Sheet'!G26=\"N/A\",\"N/A\",'Facility Cover Sheet'!G26*F18)","v":{"$error":"#DIV/0!"}}]
[]
[" 3. Bridge Plates Hinged at Higher Deck",3,{"$f":"IF(D20=\"N/A\",\"N/A\",1*B20)","v":{"$error":"#DIV/0!"}},{"$f":"IF('Facility Cover Sheet'!A26=\"N/A\",\"N/A\",'Facility Cover Sheet'!A26*B20)","v":{"$error":"#DIV/0!"}},"  3. Seat/Floor Protection in Place",2,{"$f":"IF(H20=\"N/A\",\"N/A\",1*F20)","v":{"$error":"#DIV/0!"}},{"$f":"IF('Facility Cover Sheet'!G28=\"N/A\",\"N/A\",'Facility Cover Sheet'!G28*F20)","v":{"$error":"#DIV/0!"}}]
[]
[" 4. Decks Raised and Locked Prior to Unloading",3,{"$f":"IF(D22=\"N/A\",\"N/A\",1*B22)","v":{"$error":"#DIV/0!"}},{"$f":"IF('Facility Cover Sheet'!A28=\"N/A\",\"N/A\",'Facility Cover Sheet'!A28*B22)","v":{"$error":"#DIV/0!"}},"  4. Tires on Line",2,{"$f":"IF(H22=\"N/A\",\"N/A\",1*F22)","v":{"$error":"#DIV/0!"}},{"$f":"IF('Facility Cover Sheet'!G30=\"N/A\",\"N/A\",'Facility Cover Sheet'!G30*F22)","v":{"$error":"#DIV/0!"}}]
[]
[" 5. Decks Lowered and Locked by Hand",2,{"$f":"IF(D24=\"N/A\",\"N/A\",1*B24)","v":{"$error":"#DIV/0!"}},{"$f":"IF('Facility Cover Sheet'!A30=\"N/A\",\"N/A\",'Facility Cover Sheet'!A30*B24)","v":{"$error":"#DIV/0!"}},"  5. Bumper Interspacing 10\"",1,{"$f":"IF(H24=\"N/A\",\"N/A\",1*F24)","v":{"$error":"#DIV/0!"}},{"$f":"IF('Facility Cover Sheet'!G32=\"N/A\",\"N/A\",'Facility Cover Sheet'!G32*F24)","v":{"$error":"#DIV/0!"}}]
[]
[" 6. Bridge Plates Lowered Down ",1,{"$f":"IF(D26=\"N/A\",\"N/A\",1*B26)","v":{"$error":"#DIV/0!"}},{"$f":"IF('Facility Cover Sheet'!A32=\"N/A\",\"N/A\",'Facility Cover Sheet'!A32*B26)","v":{"$error":"#DIV/0!"}},"  6. Windows, Doors, etc. Closed",3,{"$f":"IF(H26=\"N/A\",\"N/A\",1*F26)","v":{"$error":"#DIV/0!"}},{"$f":"IF('Facility Cover Sheet'!G34=\"N/A\",\"N/A\",'Facility Cover Sheet'!G34*F26)","v":{"$error":"#DIV/0!"}}]
[]
[" 7. End Doors Closed and Locked",2,{"$f":"IF(D28=\"N/A\",\"N/A\",1*B28)","v":{"$error":"#DIV/0!"}},{"$f":"IF('Facility Cover Sheet'!A34=\"N/A\",\"N/A\",'Facility Cover Sheet'!A34*B28)","v":{"$error":"#DIV/0!"}},"E. FACILITY PROCEDURES/CONDITIONS",null,{"$f":"SUM(G29:G42)","v":{"$error":"#DIV/0!"}},{"$f":"SUM(H29:H42)/G28","v":{"$error":"#DIV/0!"}}]
[]
[" 8. Bridge Plate Condition/Meet Standards",3,{"$f":"IF(D30=\"N/A\",\"N/A\",1*B30)","v":{"$error":"#DIV/0!"}},{"$f":"IF('Facility Cover Sheet'!A36=\"N/A\",\"N/A\",'Facility Cover Sheet'!A36*B30)","v":{"$error":"#DIV/0!"}},"  1. Vehicle Security Inspection-Upon Exit",1,{"$f":"IF(H30=\"N/A\",\"N/A\",1*F30)","v":{"$error":"#DIV/0!"}},{"$f":"IF('Facility Cover Sheet'!G38=\"N/A\",\"N/A\",'Facility Cover Sheet'!G38*F30)","v":{"$error":"#DIV/0!"}}]
[]
["C. UNLOADING PROCEDURES",null,{"$f":"SUM(C33:C44,G3:G12)","v":{"$error":"#DIV/0!"}},{"$f":"SUM(D33:D44,H3:H12)/C32","v":{"$error":"#DIV/0!"}},"  2. Gates Closed and Locked When Not in Use",1,{"$f":"IF(H32=\"N/A\",\"N/A\",1*F32)","v":{"$error":"#DIV/0!"}},{"$f":"IF('Facility Cover Sheet'!G40=\"N/A\",\"N/A\",'Facility Cover Sheet'!G40*F32)","v":{"$error":"#DIV/0!"}}]
[]
[" 1. Chocks/Harnesses Properly Stored",2,{"$f":"IF(D34=\"N/A\",\"N/A\",1*B34)","v":{"$error":"#DIV/0!"}},{"$f":"IF('Facility Cover Sheet'!A40=\"N/A\",\"N/A\",'Facility Cover Sheet'!A40*B34)","v":{"$error":"#DIV/0!"}},"  3. Pavement Condition",2,{"$f":"IF(H34=\"N/A\",\"N/A\",1*F34)","v":{"$error":"#DIV/0!"}},{"$f":"IF('Facility Cover Sheet'!G42=\"N/A\",\"N/A\",'Facility Cover Sheet'!G42*F34)","v":{"$error":"#DIV/0!"}}]
[]
[" 2. No Start Vehicles Unloaded Properly",1,{"$f":"IF(D36=\"N/A\",\"N/A\",1*B36)","v":{"$error":"#DIV/0!"}},{"$f":"IF('Facility Cover Sheet'!A42=\"N/A\",\"N/A\",'Facility Cover Sheet'!A42*B36)","v":{"$error":"#DIV/0!"}},"  4. Storage Area Clean",2,{"$f":"IF(H36=\"N/A\",\"N/A\",1*F36)","v":{"$error":"#DIV/0!"}},{"$f":"IF('Facility Cover Sheet'!G44=\"N/A\",\"N/A\",'Facility Cover Sheet'!G44*F36)","v":{"$error":"#DIV/0!"}}]
[]
[" 3. Clothing Condition",3,{"$f":"IF(D38=\"N/A\",\"N/A\",1*B38)","v":{"$error":"#DIV/0!"}},{"$f":"IF('Facility Cover Sheet'!A44=\"N/A\",\"N/A\",'Facility Cover Sheet'!A44*B38)","v":{"$error":"#DIV/0!"}},"  5. Unloading Ramp Condition",3,{"$f":"IF(H38=\"N/A\",\"N/A\",1*F38)","v":{"$error":"#DIV/0!"}},{"$f":"IF('Facility Cover Sheet'!G46=\"N/A\",\"N/A\",'Facility Cover Sheet'!G46*F38)","v":{"$error":"#DIV/0!"}}]
[]
[" 4. Avoid Touching Vehicles",3,{"$f":"IF(D40=\"N/A\",\"N/A\",1*B40)","v":{"$error":"#DIV/0!"}},{"$f":"IF('Facility Cover Sheet'!A46=\"N/A\",\"N/A\",'Facility Cover Sheet'!A46*B40)","v":{"$error":"#DIV/0!"}},"  6. All Tools Used on Loaded Multi-Levels Covered",3,{"$f":"IF(H40=\"N/A\",\"N/A\",1*F40)","v":{"$error":"#DIV/0!"}},{"$f":"IF('Facility Cover Sheet'!G48=\"N/A\",\"N/A\",'Facility Cover Sheet'!G48*F40)","v":{"$error":"#DIV/0!"}}]
[]
[" 5. Door Opening Careful",3,{"$f":"IF(D42=\"N/A\",\"N/A\",1*B42)","v":{"$error":"#DIV/0!"}},{"$f":"IF('Facility Cover Sheet'!A48=\"N/A\",\"N/A\",'Facility Cover Sheet'!A48*B42)","v":{"$error":"#DIV/0!"}},"  7. Is AAR/TTCI Website used for Training Purposes",1,{"$f":"IF(H42=\"N/A\",\"N/A\",1*F42)","v":{"$error":"#DIV/0!"}},{"$f":"IF('Facility Cover Sheet'!G50=\"N/A\",\"N/A\",'Facility Cover Sheet'!G50*F42)","v":{"$error":"#DIV/0!"}}]
[]
[" 6. Multi-Level Speeds",3,{"$f":"IF(D44=\"N/A\",\"N/A\",1*B44)","v":{"$error":"#DIV/0!"}},{"$f":"IF('Facility Cover Sheet'!G10=\"N/A\",\"N/A\",'Facility Cover Sheet'!G10*B44)","v":{"$error":"#DIV/0!"}}]

{"sheet":"Tally Sheet","index":4,"n_rows":65,"n_cols":71,"rows_kept":65,"cut":false,"hidden":false,"merged":[[38,64,38,65],[38,56,38,57],[40,11,40,12],[41,11,41,12],[10,26,10,27],[11,26,11,27],[6,26,6,27],[7,26,7,27],[40,26,40,27],[41,26,41,27],[40,19,40,20],[41,19,41,20],[8,26,8,27],[9,26,9,27],[40,34,40,35],[41,34,41,35],[34,26,34,27],[35,26,35,27],[36,26,36,27],[37,26,37,27],[38,26,38,27],[39,26,39,27],[40,41,40,42],[41,41,41,42],[43,64,43,65],[43,56,43,57],[42,64,42,65],[42,56,42,57],[21,71,21,72],[20,71,20,72],[27,71,27,72],[27,64,27,65],[26,71,26,72],[26,64,26,65],[41,64,41,65],[41,56,41,57],[34,64,34,65],[34,56,34,57],[37,64,37,65],[37,56,37,57],[36,64,36,65],[36,56,36,57],[40,64,40,65],[40,56,40,57],[35,64,35,65],[35,56,35,57],[39,64,39,65],[39,56,39,57],[56,4,56,5],[57,4,57,5],[58,19,58,20],[59,19,59,20],[50,11,50,12],[51,11,51,12],[52,11,52,12],[53,11,53,12],[54,11,54,12],[55,11,55,12],[58,4,58,5],[59,4,59,5],[58,11,58,12],[59,11,59,12],[50,4,50,5],[51,4,51,5],[52,4,52,5],[53,4,53,5],[54,4,54,5],[55,4,55,5],[57,19,57,20],[59,34,59,35],[50,26,50,27],[51,26,51,27],[52,26,52,27],[53,26,53,27],[54,26,54,27],[55,26,55,27],[56,11,56,12],[57,11,57,12],[58,26,58,27],[59,26,59,27],[50,19,50,20],[51,19,51,20],[52,19,52,20],[53,19,53,20],[54,19,54,20],[55,19,55,20],[50,34,50,35],[51,34,51,35],[52,34,52,35],[53,34,53,35],[54,34,54,35],[55,34,55,35],[56,19,56,20],[58,34,58,35],[56,34,56,35],[57,34,57,35],[54,41,54,42],[55,41,55,42],[56,41,56,42],[57,41,57,42],[56,26,56,27],[57,26,57,27],[58,41,58,42],[42,49,42,50],[43,49,43,50],[50,49,50,50],[51,49,51,50],[42,41,42,42],[43,41,43,42],[50,41,50,42],[51,41,51,42],[59,49,59,50],[52,49,52,50],[53,49,53,50],[52,41,52,42],[53,41,53,42],[59,41,59,42],[56,49,56,50],[57,49,57,50],[54,49,54,50],[42,26,42,27],[43,26,43,27],[34,34,34,35],[35,34,35,35],[36,34,36,35],[37,34,37,35],[38,34,38,35],[39,34,39,35],[40,49,40,50],[41,49,41,50],[42,34,42,35],[43,34,43,35],[34,41,34,42],[35,41,35,42],[36,41,36,42],[37,41,37,42],[38,41,38,42],[39,41,39,42],[34,49,34,50],[35,49,35,50],[36,49,36,50],[37,49,37,50],[38,49,38,50],[39,49,39,50],[26,11,26,12],[27,11,27,12],[34,19,34,20],[35,19,35,20],[26,19,26,20],[27,19,27,20],[42,19,42,20],[43,19,43,20],[36,19,36,20],[37,19,37,20],[38,19,38,20],[39,19,39,20],[18,19,18,20],[19,19,19,20],[20,19,20,20],[21,19,21,20],[22,19,22,20],[23,19,23,20],[24,19,24,20],[25,19,25,20],[24,11,24,12],[25,11,25,12],[18,11,18,12],[19,11,19,12],[20,11,20,12],[21,11,21,12],[22,11,22,12],[23,11,23,12],[11,56,11,57],[8,64,8,65],[9,64,9,65],[27,34,27,35],[18,26,18,27],[19,26,19,27],[20,26,20,27],[21,26,21,27],[22,26,22,27],[23,26,23,27],[24,26,24,27],[25,26,25,27],[26,26,26,27],[27,26,27,27],[26,34,26,35],[2,26,2,27],[3,26,3,27],[4,26,4,27],[19,71,19,72],[18,71,18,72],[25,71,25,72],[24,71,24,72],[23,71,23,72],[22,71,22,72],[21,49,21,50],[22,49,22,50],[2,71,2,72],[3,71,3,72],[4,71,4,72],[5,71,5,72],[6,71,6,72],[7,71,7,72],[23,49,23,50],[24,49,24,50],[10,64,10,65],[11,64,11,65],[8,71,8,72],[9,71,9,72],[10,56,10,57],[2,79,2,80],[18,4,18,5],[3,79,3,80],[4,79,4,80],[8,11,8,12],[9,11,9,12],[8,19,8,20],[9,19,9,20],[10,4,10,5],[11,4,11,5],[2,11,2,12],[3,11,3,12],[4,11,4,12],[5,11,5,12],[6,11,6,12],[7,11,7,12],[8,41,8,42],[10,49,10,50],[11,49,11,50],[10,71,10,72],[11,71,11,72],[18,49,18,50],[2,19,2,20],[3,19,3,20],[26,4,26,5],[10,34,10,35],[11,34,11,35],[8,4,8,5],[9,4,9,5],[5,26,5,27],[11,41,11,42],[10,41,10,42],[2,4,2,5],[3,4,3,5],[4,4,4,5],[5,4,5,5],[4,19,4,20],[5,19,5,20],[6,19,6,20],[7,19,7,20],[10,19,10,20],[11,19,11,20],[2,41,2,42],[3,41,3,42],[4,41,4,42],[5,41,5,42],[6,41,6,42],[7,41,7,42],[5,79,5,80],[21,4,21,5],[6,79,6,80],[22,4,22,5],[7,79,7,80],[23,4,23,5],[19,4,19,5],[20,4,20,5],[6,4,6,5],[7,4,7,5],[5,49,5,50],[6,49,6,50],[7,49,7,50],[8,49,8,50],[9,49,9,50],[5,56,5,57],[6,56,6,57],[7,56,7,57],[9,41,9,42],[10,11,10,12],[11,11,11,12],[10,79,10,80],[19,49,19,50],[20,49,20,50],[2,34,2,35],[3,34,3,35],[4,34,4,35],[5,34,5,35],[6,34,6,35],[7,34,7,35],[8,34,8,35],[9,34,9,35],[8,79,8,80],[9,79,9,80],[2,49,2,50],[3,49,3,50],[4,49,4,50],[2,56,2,57],[3,56,3,57],[4,56,4,57],[8,56,8,57],[9,56,9,57],[2,64,2,65],[3,64,3,65],[4,64,4,65],[5,64,5,65],[6,64,6,65],[7,64,7,65],[59,56,59,57],[58,49,58,50],[50,56,50,57],[51,56,51,57],[52,56,52,57],[53,56,53,57],[55,49,55,50],[11,79,11,80],[27,4,27,5],[24,4,24,5],[25,4,25,5],[25,49,25,50],[26,49,26,50],[27,49,27,50],[18,41,18,42],[26,56,26,57],[22,34,22,35],[23,34,23,35],[24,34,24,35],[25,34,25,35],[18,34,18,35],[19,34,19,35],[20,34,20,35],[21,34,21,35]]}
[]
[" A1 DECK HEIGHTS EQUAL",null,null,null,null,null,null," A2 COUPLERS IN PROPER POSITION",null,null,null,null,null,null,null," A3 PROPER HAND BRAKES SET",null,null,null,null,null,null,"A4 IS TRACK PROTECTION USED",null,null,null,null,null,null,null," B1 END DOORS OPENED AND STORED",null,null,null,null,null,null," B2 PROPER BRIDGE PLATES USED AT JUNCTIONS",null,null,null,null,null,null,null," B3 BRIDGE PLATES HINGED AT HIGHER DECK",null,null,null,null,null,null," B4 DECKS RAISED & LOCKED PRIOR TO UNLOADING",null,null,null,null,null,null,null," B5 DECKS LOWERED AND LOCKED BY HAND",null,null,null,null,null,null," B6 BRIDGE PLATES LOWERED DOWN"]
[" "," ",{"$f":"ROUND((A3/B3),4)","v":{"$error":"#VALUE!"}},{"$f":"(#REF!)","v":{"$error":"#REF!"}},null,null,null," "," ",{"$f":"ROUND((H3/I3),4)","v":{"$error":"#VALUE!"}},{"$f":"(#REF!)","v":{"$error":"#REF!"}},null,null,null,null," "," ",{"$f":"ROUND((P3/Q3),4)","v":{"$error":"#VALUE!"}},{"$f":"(#REF!)","v":{"$error":"#REF!"}},null,null,null," "," ",{"$f":"ROUND((W3/X3),4)","v":{"$error":"#VALUE!"}},{"$f":"(#REF!)","v":{"$error":"#REF!"}},null,null,null," ",null,null,{"$f":"ROUND((AE3/AF3),4)","v":{"$error":"#DIV/0!"}},{"$f":"(#REF!)","v":{"$error":"#REF!"}},null,null,null,null,null,{"$f":"ROUND((AL3/AM3),4)","v":{"$error":"#DIV/0!"}},{"$f":"(#REF!)","v":{"$error":"#REF!"}},null,null,null,null,null,null,{"$f":"ROUND((AT3/AU3),4)","v":{"$error":"#DIV/0!"}},{"$f":"(#REF!)","v":{"$error":"#REF!"}},null,null,null,null,null,{"$f":"ROUND((BA3/BB3),4)","v":{"$error":"#DIV/0!"}},{"$f":"(#REF!)","v":{"$error":"#REF!"}},null,null,null,null,null,null,{"$f":"ROUND((BI3/BJ3),4)","v":{"$error":"#DIV/0!"}},{"$f":"(#REF!)","v":{"$error":"#REF!"}},null,null,null,null,null,{"$f":"ROUND((BP3/BQ3),4)","v":{"$error":"#DIV/0!"}},{"$f":"(#REF!)","v":{"$error":"#REF!"}}]
[null,null,{"$f":"ROUND((A4/B4),4)","v":{"$error":"#DIV/0!"}},{"$f":"(#REF!)","v":{"$error":"#REF!"}},null,null,null,null,null,{"$f":"ROUND((H4/I4),4)","v":{"$error":"#DIV/0!"}},{"$f":"(#REF!)","v":{"$error":"#REF!"}},null,null,null,null,null,null,{"$f":"ROUND((P4/Q4),4)","v":{"$error":"#DIV/0!"}},{"$f":"(#REF!)","v":{"$error":"#REF!"}},null,null,null,null,null,{"$f":"ROUND((W4/X4),4)","v":{"$error":"#DIV/0!"}},{"$f":"(#REF!)","v":{"$error":"#REF!"}},null,null,null,null,null,null,{"$f":"ROUND((AE4/AF4),4)","v":{"$error":"#DIV/0!"}},{"$f":"(#REF!)","v":{"$error":"#REF!"}},null,null,null,null,null,{"$f":"ROUND((AL4/AM4),4)","v":{"$error":"#DIV/0!"}},{"$f":"(#REF!)","v":{"$error":"#REF!"}},null,null,null,null,null,null,{"$f":"ROUND((AT4/AU4),4)","v":{"$error":"#DIV/0!"}},{"$f":"(#REF!)","v":{"$error":"#REF!"}},null,null,null,null,null,{"$f":"ROUND((BA4/BB4),4)","v":{"$error":"#DIV/0!"}},{"$f":"(#REF!)","v":{"$error":"#REF!"}},null,null,null,null,null,null,{"$f":"ROUND((BI4/BJ4),4)","v":{"$error":"#DIV/0!"}},{"$f":"(#REF!)","v":{"$error":"#REF!"}},null,null,null,null,null,{"$f":"ROUND((BP4/BQ4),4)","v":{"$error":"#DIV/0!"}},{"$f":"(#REF!)","v":{"$error":"#REF!"}}]
[null,null,{"$error":"#DIV/0!"},{"$f":"(#REF!)","v":{"$error":"#REF!"}},null,null,null,null,null,{"$error":"#DIV/0!"},{"$f":"(#REF!)","v":{"$error":"#REF!"}},null,null,null,null,null,null,{"$error":"#DIV/0!"},{"$f":"(#REF!)","v":{"$error":"#REF!"}},null,null,null,null,null,{"$error":"#DIV/0!"},{"$f":"(#REF!)","v":{"$error":"#REF!"}},null,null,null,null,null,null,{"$error":"#DIV/0!"},{"$f":"(#REF!)","v":{"$error":"#REF!"}},null,null,null,null,null,{"$error":"#DIV/0!"},{"$f":"(#REF!)","v":{"$error":"#REF!"}},null,null,null,null,null,null,{"$error":"#DIV/0!"},{"$f":"(#REF!)","v":{"$error":"#REF!"}},null,null,null,null,null,{"$error":"#DIV/0!"},{"$f":"(#REF!)","v":{"$error":"#REF!"}},null,null,null,null,null,null,{"$error":"#DIV/0!"},{"$f":"(#REF!)","v":{"$error":"#REF!"}},null,null,null,null,null,{"$error":"#DIV/0!"},{"$f":"(#REF!)","v":{"$error":"#REF!"}}]
[null,null,{"$error":"#DIV/0!"},{"$f":"(#REF!)","v":{"$error":"#REF!"}},null,null,null,null,null,{"$error":"#DIV/0!"},{"$f":"(#REF!)","v":{"$error":"#REF!"}},null,null,null,null,null,null,{"$error":"#DIV/0!"},{"$f":"(#REF!)","v":{"$error":"#REF!"}},null,null,null,null,null,{"$error":"#DIV/0!"},{"$f":"(#REF!)","v":{"$error":"#REF!"}},null,null,null,null,null,null,{"$error":"#DIV/0!"},{"$f":"(#REF!)","v":{"$error":"#REF!"}},null,null,null,null,null,{"$error":"#DIV/0!"},{"$f":"(#REF!)","v":{"$error":"#REF!"}},null,null,null,null,null,null,{"$error":"#DIV/0!"},{"$f":"(#REF!)","v":{"$error":"#REF!"}},null,null,null,null,null,{"$error":"#DIV/0!"},{"$f":"(#REF!)","v":{"$error":"#REF!"}},null,null,null,null,null,null,{"$error":"#DIV/0!"},{"$f":"(#REF!)","v":{"$error":"#REF!"}},null,null,null,null,null,{"$error":"#DIV/0!"},{"$f":"(#REF!)","v":{"$error":"#REF!"}}]
[null,null,{"$error":"#DIV/0!"},{"$f":"(#REF!)","v":{"$error":"#REF!"}},null,null,null,null,null,{"$error":"#DIV/0!"},{"$f":"(#REF!)","v":{"$error":"#REF!"}},null,null,null,null,null,null,{"$error":"#DIV/0!"},{"$f":"(#REF!)","v":{"$error":"#REF!"}},null,null,null,null,null,{"$error":"#DIV/0!"},{"$f":"(#REF!)","v":{"$error":"#REF!"}},null,null,null,null,null,null,{"$error":"#DIV/0!"},{"$f":"(#REF!)","v":{"$error":"#REF!"}},null,null,null,null,null,{"$error":"#DIV/0!"},{"$f":"(#REF!)","v":{"$error":"#REF!"}},null,null,null,null,null,null,{"$error":"#DIV/0!"},{"$f":"(#REF!)","v":{"$error":"#REF!"}},null,null,null,null,null,{"$error":"#DIV/0!"},{"$f":"(#REF!)","v":{"$error":"#REF!"}},null,null,null,null,null,null,{"$error":"#DIV/0!"},{"$f":"(#REF!)","v":{"$error":"#REF!"}},null,null,null,null,null,{"$error":"#DIV/0!"},{"$f":"(#REF!)","v":{"$error":"#REF!"}}]
[]
[]
[null,null,null,null,null,null,null,null,null,null,null,null,null,null,null,null,null,null,null,null,null,null,null,null,null,null,"A. Multi-level Placement"]
[null,null,null,null,null,null,null,null,null,null,null,null,null,null,null,null,null,null,null,null,null,null,null,null,null,null,{"$f":"('Facility Cover Sheet'!A10)","v":{"$error":"#DIV/0!"}}]
[]
["    TOTAL COUNT",null,null,null,null,null,null,"    TOTAL COUNT",null,null,null,null,null,null,null,"    TOTAL COUNT",null,null,null,null,null,null,"    TOTAL COUNT",null,null,null,null,null,null,null,"    TOTAL COUNT",null,null,null,null,null,null,"    TOTAL COUNT",null,null,null,null,null,null,null,"    TOTAL COUNT",null,null,null,null,null,null,"    TOTAL COUNT",null,null,null,null,null,null,null,"    TOTAL COUNT",null,null,null,null,null,null,"    TOTAL COUNT"]
[{"$f":"SUM(A3:A12)","v":0},{"$f":"SUM(B3:B12)","v":0},null,null,null,null,null,{"$f":"SUM(H3:H12)","v":0},{"$f":"SUM(I3:I12)","v":0},null,null,null,null,null,null,{"$f":"SUM(P3:P12)","v":0},{"$f":"SUM(Q3:Q12)","v":0},null,null,null,null,null,{"$f":"SUM(W3:W12)","v":0},{"$f":"SUM(X3:X12)","v":0},null,null,null,null,null,null,{"$f":"SUM(AE3:AE12)","v":0},{"$f":"SUM(AF3:AF12)","v":0},null,null,null,null,null,{"$f":"SUM(AL3:AL12)","v":0},{"$f":"SUM(AM3:AM12)","v":0},null,null,null,null,null,null,{"$f":"SUM(AT3:AT12)","v":0},{"$f":"SUM(AU3:AU12)","v":0},null,null,null,null,null,{"$f":"SUM(BA3:BA12)","v":0},{"$f":"SUM(BB3:BB12)","v":0},null,null,null,null,null,null,{"$f":"SUM(BI3:BI12)","v":0},{"$f":"SUM(BJ3:BJ12)","v":0},null,null,null,null,null,{"$f":"SUM(BP3:BP12)","v":0},{"$f":"SUM(BQ3:BQ12)","v":0}]
[]
[" TOTAL PERCENTAGE",null,null,null,null,null,null," TOTAL PERCENTAGE",null,null,null,null,null,null,null," TOTAL PERCENTAGE",null,null,null,null,null,null," TOTAL PERCENTAGE",null,null,null,null,null,null,null," TOTAL PERCENTAGE",null,null,null,null,null,null," TOTAL PERCENTAGE",null,null,null,null,null,null,null," TOTAL PERCENTAGE",null,null,null,null,null,null," TOTAL PERCENTAGE",null,null,null,null,null,null,null," TOTAL PERCENTAGE",null,null,null,null,null,null," TOTAL PERCENTAGE"]
[{"$f":"IF(ROUND((C17),4)<=0.9943,ROUND((C17),4),IF((C17)<1,0.99,IF((C17)=1,1,(C16))))","v":{"$error":"#DIV/0!"}},null,{"$f":"ROUND(SUM(A3:A12)/SUM(B3:B12),4)","v":{"$error":"#DIV/0!"}},null,null,null,null,{"$f":"IF(ROUND((J17),4)<=0.9943,ROUND((J17),4),IF((J17)<1,0.99,IF((J17)=1,1,(J16))))","v":{"$error":"#DIV/0!"}},null,{"$f":"ROUND(SUM(H3:H12)/SUM(I3:I12),4)","v":{"$error":"#DIV/0!"}},null,null,null,null,null,{"$f":"IF(ROUND((R17),4)<=0.9943,ROUND((R17),4),IF((R17)<1,0.99,IF((R17)=1,1,(R16))))","v":{"$error":"#DIV/0!"}},null,{"$f":"ROUND(SUM(P3:P12)/SUM(Q3:Q12),4)","v":{"$error":"#DIV/0!"}},null,null,null,null,{"$f":"IF(ROUND((Y17),4)<=0.9943,ROUND((Y17),4),IF((Y17)<1,0.99,IF((Y17)=1,1,(Y16))))","v":{"$error":"#DIV/0!"}},null,{"$f":"ROUND(SUM(W3:W12)/SUM(X3:X12),4)","v":{"$error":"#DIV/0!"}},null,null,null,null,null,{"$f":"IF(ROUND((AG17),4)<=0.9943,ROUND((AG17),4),IF((AG17)<1,0.99,IF((AG17)=1,1,(AG16))))","v":{"$error":"#DIV/0!"}},null,{"$f":"ROUND(SUM(AE3:AE12)/SUM(AF3:AF12),4)","v":{"$error":"#DIV/0!"}},null,null,null,null,{"$f":"IF(ROUND((AN17),4)<=0.9943,ROUND((AN17),4),IF((AN17)<1,0.99,IF((AN17)=1,1,(AN16))))","v":{"$error":"#DIV/0!"}},null,{"$f":"ROUND(SUM(AL3:AL12)/SUM(AM3:AM12),4)","v":{"$error":"#DIV/0!"}},null,null,null,null,null,{"$f":"IF(ROUND((AV17),4)<=0.9943,ROUND((AV17),4),IF((AV17)<1,0.99,IF((AV17)=1,1,(AV16))))","v":{"$error":"#DIV/0!"}},null,{"$f":"ROUND(SUM(AT3:AT12)/SUM(AU3:AU12),4)","v":{"$error":"#DIV/0!"}},null,null,null,null,{"$f":"IF(ROUND((BC17),4)<=0.9943,ROUND((BC17),4),IF((BC17)<1,0.99,IF((BC17)=1,1,(BC16))))","v":{"$error":"#DIV/0!"}},null,{"$f":"ROUND(SUM(BA3:BA12)/SUM(BB3:BB12),4)","v":{"$error":"#DIV/0!"}},null,null,null,null,null,{"$f":"IF(ROUND((BK17),4)<=0.9943,ROUND((BK17),4),IF((BK17)<1,0.99,IF((BK17)=1,1,(BK16))))","v":{"$error":"#DIV/0!"}},null,{"$f":"ROUND(SUM(BI3:BI12)/SUM(BJ3:BJ12),4)","v":{"$error":"#DIV/0!"}},null,null,null,null,{"$f":"IF(ROUND((BR17),4)<=0.9943,ROUND((BR17),4),IF((BR17)<1,0.99,IF((BR17)=1,1,(BR16))))","v":{"$error":"#DIV/0!"}},null,{"$f":"ROUND(SUM(BP3:BP12)/SUM(BQ3:BQ12),4)","v":{"$error":"#DIV/0!"}}]
[" B7 END DOORS CLOSED AND LOCKED",null,null,null,null,null,null," B8 BRIDGE PLATE CONDITION",null,null,null,null,null,null,null," C1 CHOCKS/HARNESSES PROPERLY STORED",null,null,null,null,null,null," C2 NO START VEHICLES UNLOADED PROPERLY",null,null,null,null,null,null,null," C3 CLOTHING CONDITION",null,null,null,null,null,null," C4 AVOID TOUCHING VEHICLES",null,null,null,null,null,null,null," C5 DOOR OPENING CAREFUL",null,null,null,null,null,null," C6 MULTI-LEVEL SPEEDS",null,null,null,null,null,null,null," C7RAMP/STORAGE AREA SPEEDS",null,null,null,null,null,null,"  C8 NO VEHICLE SHUTTLING"]
[null,null,{"$f":"ROUND((A19/B19),4)","v":{"$error":"#DIV/0!"}},{"$f":"(#REF!)","v":{"$error":"#REF!"}},null,null,null,null,null,{"$f":"ROUND((H19/I19),4)","v":{"$error":"#DIV/0!"}},{"$f":"(#REF!)","v":{"$error":"#REF!"}},null,null,null,null,null,null,{"$f":"ROUND((P19/Q19),4)","v":{"$error":"#DIV/0!"}},{"$f":"(#REF!)","v":{"$error":"#REF!"}},null,null,null,null,null,{"$f":"ROUND((W19/X19),4)","v":{"$error":"#DIV/0!"}},{"$f":"(#REF!)","v":{"$error":"#REF!"}},null,null,null,null,null,null,{"$f":"ROUND((AE19/AF19),4)","v":{"$error":"#DIV/0!"}},{"$f":"(#REF!)","v":{"$error":"#REF!"}},null,null,null,null,null,{"$f":"ROUND((AL19/AM19),4)","v":{"$error":"#DIV/0!"}},{"$f":"(#REF!)","v":{"$error":"#REF!"}},null,null,null,null,null,null,{"$f":"ROUND((AT19/AU19),4)","v":{"$error":"#DIV/0!"}},{"$f":"(#REF!)","v":{"$error":"#REF!"}},null,null,null,{"$f":"'US. Speed Sheet'!B53","v":0},{"$f":"'US. Speed Sheet'!B50","v":0},null,null,null,null,null,null,{"$f":"'US. Speed Sheet'!D53","v":0},{"$f":"'US. Speed Sheet'!D50","v":0},null,null,null,null,null,null,null,{"$f":"ROUND((BP19/BQ19),4)","v":{"$error":"#DIV/0!"}},{"$f":"(#REF!)","v":{"$error":"#REF!"}}]
[null,null,{"$f":"ROUND((A20/B20),4)","v":{"$error":"#DIV/0!"}},{"$f":"(#REF!)","v":{"$error":"#REF!"}},null,null,null,null,null,{"$f":"ROUND((H20/I20),4)","v":{"$error":"#DIV/0!"}},{"$f":"(#REF!)","v":{"$error":"#REF!"}},null,null,null,null,null,null,{"$f":"ROUND((P20/Q20),4)","v":{"$error":"#DIV/0!"}},{"$f":"(#REF!)","v":{"$error":"#REF!"}},null,null,null,null,null,{"$f":"ROUND((W20/X20),4)","v":{"$error":"#DIV/0!"}},{"$f":"(#REF!)","v":{"$error":"#REF!"}},null,null,null,null,null,null,{"$f":"ROUND((AE20/AF20),4)","v":{"$error":"#DIV/0!"}},{"$f":"(#REF!)","v":{"$error":"#REF!"}},null,null,null,null,null,{"$f":"ROUND((AL20/AM20),4)","v":{"$error":"#DIV/0!"}},{"$f":"(#REF!)","v":{"$error":"#REF!"}},null,null,null,null,null,null,{"$f":"ROUND((AT20/AU20),4)","v":{"$error":"#DIV/0!"}},{"$f":"(#REF!)","v":{"$error":"#REF!"}},null,null,null,null,null,{"$f":"ROUND((BA20/BB20),4)","v":{"$error":"#DIV/0!"}},{"$f":"(#REF!)","v":{"$error":"#REF!"}},"High Speed Equals MPH",{"$f":"('US. Speed Sheet'!B46)","v":0},null,null,null,null,{"$f":"ROUND((BI20/BJ20),4)","v":{"$error":"#DIV/0!"}},{"$f":"(#REF!)","v":{"$error":"#REF!"}},"High Speed Equals MPH",{"$f":"('US. Speed Sheet'!D46)","v":0},null,null,null,{"$f":"ROUND((BP20/BQ20),4)","v":{"$error":"#DIV/0!"}},{"$f":"(#REF!)","v":{"$error":"#REF!"}}]
[null,null,{"$error":"#DIV/0!"},{"$f":"(#REF!)","v":{"$error":"#REF!"}},null,null,null,null,null,{"$error":"#DIV/0!"},{"$f":"(#REF!)","v":{"$error":"#REF!"}},null,null,null,null,null,null,{"$error":"#DIV/0!"},{"$f":"(#REF!)","v":{"$error":"#REF!"}},null,null,null,null,null,{"$error":"#DIV/0!"},{"$f":"(#REF!)","v":{"$error":"#REF!"}},null,null,null,null,null,null,{"$error":"#DIV/0!"},{"$f":"(#REF!)","v":{"$error":"#REF!"}},null,null,null,null,null,{"$error":"#DIV/0!"},{"$f":"(#REF!)","v":{"$error":"#REF!"}},null,null,null,null,null,null,{"$error":"#DIV/0!"},{"$f":"(#REF!)","v":{"$error":"#REF!"}},null,null,null,null,null,{"$f":"ROUND((BA21/BB21),4)","v":{"$error":"#DIV/0!"}},{"$f":"(#REF!)","v":{"$error":"#REF!"}},"Low Speed Equals MPH",{"$f":"('US. Speed Sheet'!B47)","v":0},null,null,null,null,{"$f":"ROUND((BI21/BJ21),4)","v":{"$error":"#DIV/0!"}},{"$f":"(#REF!)","v":{"$error":"#REF!"}},"Low Speed Equals MPH",{"$f":"('US. Speed Sheet'!D47)","v":0},null,null,null,{"$error":"#DIV/0!"},{"$f":"(#REF!)","v":{"$error":"#REF!"}}]
[null,null,{"$error":"#DIV/0!"},{"$f":"(#REF!)","v":{"$error":"#REF!"}},null,null,null,null,null,{"$error":"#DIV/0!"},{"$f":"(#REF!)","v":{"$error":"#REF!"}},null,null,null,null,null,null,{"$error":"#DIV/0!"},{"$f":"(#REF!)","v":{"$error":"#REF!"}},null,null,null,null,null,{"$error":"#DIV/0!"},{"$f":"(#REF!)","v":{"$error":"#REF!"}},null,null,null,null,null,null,{"$error":"#DIV/0!"},{"$f":"(#REF!)","v":{"$error":"#REF!"}},null,null,null,null,null,{"$error":"#DIV/0!"},{"$f":"(#REF!)","v":{"$error":"#REF!"}},null,null,null,null,null,null,{"$error":"#DIV/0!"},{"$f":"(#REF!)","v":{"$error":"#REF!"}},null,null,null,null,null,{"$error":"#DIV/0!"},{"$f":"(#REF!)","v":{"$error":"#REF!"}},"Avg.Speed Equals MPH",{"$f":"('US. Speed Sheet'!B48)","v":{"$error":"#DIV/0!"}},null,null,null,null,{"$error":"#DIV/0!"},{"$f":"(#REF!)","v":{"$error":"#REF!"}},"Avg.Speed Equals MPH",{"$f":"('US. Speed Sheet'!D48)","v":{"$error":"#DIV/0!"}},null,null,null,{"$error":"#DIV/0!"},{"$f":"(#REF!)","v":{"$error":"#REF!"}}]
[null,null,{"$error":"#DIV/0!"},{"$f":"(#REF!)","v":{"$error":"#REF!"}},null,null,null,null,null,{"$error":"#DIV/0!"},{"$f":"(#REF!)","v":{"$error":"#REF!"}},null,null,null,null,null,null,{"$error":"#DIV/0!"},{"$f":"(#REF!)","v":{"$error":"#REF!"}},null,null,null,null,null,{"$error":"#DIV/0!"},{"$f":"(#REF!)","v":{"$error":"#REF!"}},null,null,null,null,null,null,{"$error":"#DIV/0!"},{"$f":"(#REF!)","v":{"$error":"#REF!"}},null,null,null,null,null,{"$error":"#DIV/0!"},{"$f":"(#REF!)","v":{"$error":"#REF!"}},null,null,null,null,null,null,{"$error":"#DIV/0!"},{"$f":"(#REF!)","v":{"$error":"#REF!"}},null,null,null,null,null,{"$error":"#DIV/0!"},{"$f":"(#REF!)","v":{"$error":"#REF!"}},null,null,null,null,null,null,{"$error":"#DIV/0!"},{"$f":"(#REF!)","v":{"$error":"#REF!"}},null,null,null,null,null,{"$error":"#DIV/0!"},{"$f":"(#REF!)","v":{"$error":"#REF!"}}]
[null,null,null,null,null,null,null,null,null,null,null,null,null,null,null,null,null,null,null,null,null,null,null,null,null,null,null,null,null,null,null,null,null,null,null,null,null,null,null,null,null,null,null,null,null,null,null,null,null,null,null,null,null,null,{"$error":"#DIV/0!"},{"$f":"(#REF!)","v":{"$error":"#REF!"}},"High Speed Equals KPH",null,null,null,null,null,{"$error":"#DIV/0!"},{"$f":"(#REF!)","v":{"$error":"#REF!"}},"High Speed Equals KPH"]
[null,null,null,null,null,null,null,null,null,null,null,null,null,null,null,null,null,null,null,null,null,null,null,null,null,null,null,null,null,null,null,null,null,null,null,null,null,null,null,null,null,null,null,null,null,null,null,null,null,null,null,null,null,null,null,null,"Low Speed Equals KPH",null,null,null,null,null,null,null,"Low Speed Equals KPH"]
[null,null,null,null,null,null,null,null,null,null,null,"B. End Dr. Decks B Plates",null,null,null,null,null,null,null,null,null,null,null,null,null,null,null,null,null,null,null,null,null,null,null,null,null,null,null,null,null,null,null,null,null,null,null,null,null,null,null,null,null,null,null,null,"Avg.Speed Equals KPH",null,null,null,null,null,null,null,"Avg.Speed Equals KPH"]
[null,null,null,null,null,null,null,null,null,null,null,{"$f":"('Facility Cover Sheet'!A20)","v":{"$error":"#DIV/0!"}}]
[]
["    TOTAL COUNT",null,null,null,null,null,null,"    TOTAL COUNT",null,null,null,null,null,null,null,"    TOTAL COUNT",null,null,null,null,null,null,"    TOTAL COUNT",null,null,null,null,null,null,null,"    TOTAL COUNT",null,null,null,null,null,null,"    TOTAL COUNT",null,null,null,null,null,null,null,"    TOTAL COUNT",null,null,null,null,null,null,"    TOTAL COUNT",null,null,null,null,null,null,null,"    TOTAL COUNT",null,null,null,null,null,null,"    TOTAL COUNT"]
[{"$f":"SUM(A19:A28)","v":0},{"$f":"SUM(B19:B28)","v":0},null,null,null,null,null,{"$f":"SUM(H19:H28)","v":0},{"$f":"SUM(I19:I28)","v":0},null,null,null,null,null,null,{"$f":"SUM(P19:P28)","v":0},{"$f":"SUM(Q19:Q28)","v":0},null,null,null,null,null,{"$f":"SUM(W19:W28)","v":0},{"$f":"SUM(X19:X28)","v":0},null,null,null,null,null,null,{"$f":"SUM(AE19:AE28)","v":0},{"$f":"SUM(AF19:AF28)","v":0},null,null,null,null,null,{"$f":"SUM(AL19:AL28)","v":0},{"$f":"SUM(AM19:AM28)","v":0},null,null,null,null,null,null,{"$f":"SUM(AT19:AT28)","v":0},{"$f":"SUM(AU19:AU28)","v":0},null,null,null,null,null,{"$f":"SUM(BA19:BA28)","v":0},{"$f":"SUM(BB19:BB28)","v":0},null,null,null,null,null,null,{"$f":"SUM(BI19:BI28)","v":0},{"$f":"SUM(BJ19:BJ28)","v":0},null,null,null,null,null,{"$f":"SUM(BP19:BP28)","v":0},{"$f":"SUM(BQ19:BQ28)","v":0}]
[]
[" TOTAL PERCENTAGE",null,null,null,null,null,null," TOTAL PERCENTAGE",null,null,null,null,null,null,null," TOTAL PERCENTAGE",null,null,null,null,null,null," TOTAL PERCENTAGE",null,null,null,null,null,null,null," TOTAL PERCENTAGE",null,null,null,null,null,null," TOTAL PERCENTAGE",null,null,null,null,null,null,null," TOTAL PERCENTAGE",null,null,null,null,null,null," TOTAL PERCENTAGE",null,null,null,null,null,null,null," TOTAL PERCENTAGE",null,null,null,null,null,null," TOTAL PERCENTAGE"]
[{"$f":"IF(ROUND((C33),4)<=0.9943,ROUND((C33),4),IF((C33)<1,0.99,IF((C33)=1,1,(C32))))","v":{"$error":"#DIV/0!"}},null,{"$f":"ROUND(SUM(A19:A28)/SUM(B19:B28),4)","v":{"$error":"#DIV/0!"}},null,null,null,null,{"$f":"IF(ROUND((J33),4)<=0.9943,ROUND((J33),4),IF((J33)<1,0.99,IF((J33)=1,1,(J32))))","v":{"$error":"#DIV/0!"}},null,{"$f":"ROUND(SUM(H19:H28)/SUM(I19:I28),4)","v":{"$error":"#DIV/0!"}},null,null,null,null,null,{"$f":"IF(ROUND((R33),4)<=0.9943,ROUND((R33),4),IF((R33)<1,0.99,IF((R33)=1,1,(R32))))","v":{"$error":"#DIV/0!"}},null,{"$f":"ROUND(SUM(P19:P28)/SUM(Q19:Q28),4)","v":{"$error":"#DIV/0!"}},null,null,null,null,{"$f":"IF(ROUND((Y33),4)<=0.9943,ROUND((Y33),4),IF((Y33)<1,0.99,IF((Y33)=1,1,(Y32))))","v":{"$error":"#DIV/0!"}},null,{"$f":"ROUND(SUM(W19:W28)/SUM(X19:X28),4)","v":{"$error":"#DIV/0!"}},null,null,null,null,null,{"$f":"IF(ROUND((AG33),4)<=0.9943,ROUND((AG33),4),IF((AG33)<1,0.99,IF((AG33)=1,1,(AG32))))","v":{"$error":"#DIV/0!"}},null,{"$f":"ROUND(SUM(AE19:AE28)/SUM(AF19:AF28),4)","v":{"$error":"#DIV/0!"}},null,null,null,null,{"$f":"IF(ROUND((AN33),4)<=0.9943,ROUND((AN33),4),IF((AN33)<1,0.99,IF((AN33)=1,1,(AN32))))","v":{"$error":"#DIV/0!"}},null,{"$f":"ROUND(SUM(AL19:AL28)/SUM(AM19:AM28),4)","v":{"$error":"#DIV/0!"}},null,null,null,null,null,{"$f":"IF(ROUND((AV33),4)<=0.9943,ROUND((AV33),4),IF((AV33)<1,0.99,IF((AV33)=1,1,(AV32))))","v":{"$error":"#DIV/0!"}},null,{"$f":"ROUND(SUM(AT19:AT28)/SUM(AU19:AU28),4)","v":{"$error":"#DIV/0!"}},null,null,null,null,{"$f":"IF(ROUND((BC33),4)<=0.9943,ROUND((BC33),4),IF((BC33)<1,0.99,IF((BC33)=1,1,(BC32))))","v":{"$error":"#DIV/0!"}},null,{"$f":"ROUND(SUM(BA19:BA28)/SUM(BB19:BB28),4)","v":{"$error":"#DIV/0!"}},null,null,null,null,null,{"$f":"IF(ROUND((BK33),4)<=0.9943,ROUND((BK33),4),IF((BK33)<1,0.99,IF((BK33)=1,1,(BK32))))","v":{"$error":"#DIV/0!"}},null,{"$f":"ROUND(SUM(BI19:BI28)/SUM(BJ19:BJ28),4)","v":{"$error":"#DIV/0!"}},null,null,null,null,{"$f":"IF(ROUND((BR33),4)<=0.9943,ROUND((BR33),4),IF((BR33)<1,0.99,IF((BR33)=1,1,(BR32))))","v":{"$error":"#DIV/0!"}},null,{"$f":"ROUND(SUM(BP19:BP28)/SUM(BQ19:BQ28),4)","v":{"$error":"#DIV/0!"}}]
[" C9 NO CELL PHONES/TEXTING/MP3/ LOUNGING/EATING/SMOKING",null,null,null,null,null,null," C10 RAMP PROPERLY POSITIONED",null,null,null,null,null,null,null," C11 ARE VEHICLES SHUTOFF WHEN NOT ATTENDED",null,null,null,null,null,null," D1  OBEY POSTED TRAFFIC REGS OBSERVE SAFE DRIVING",null,null,null,null,null,null,null," D2 ONE CAR LENGTH MAINTAINED BETWEEN VEHICLES",null,null,null,null,null,null," D3 SEAT/FLOOR PROTECTION IN PLACE",null,null,null,null,null,null,null," D4 TIRES ON LINE",null,null,null,null,null,null," D5 BUMPER INTERSPACING 10\"",null,null,null,null,null,null,null," D6 WINDOWS DOORS, etc. CLOSED"]
[null,null,{"$f":"ROUND((A35/B35),4)","v":{"$error":"#DIV/0!"}},{"$f":"(#REF!)","v":{"$error":"#REF!"}},null,null,null,null,null,{"$f":"ROUND((H35/I35),4)","v":{"$error":"#DIV/0!"}},{"$f":"(#REF!)","v":{"$error":"#REF!"}},null,null,null,null,null,null,{"$f":"ROUND((P35/Q35),4)","v":{"$error":"#DIV/0!"}},{"$f":"(#REF!)","v":{"$error":"#REF!"}},null,null,null,null,null,{"$f":"ROUND((W35/X35),4)","v":{"$error":"#DIV/0!"}},{"$f":"(#REF!)","v":{"$error":"#REF!"}},null,null,null,null,null,null,{"$f":"ROUND((AE35/AF35),4)","v":{"$error":"#DIV/0!"}},{"$f":"(#REF!)","v":{"$error":"#REF!"}},null,null,null,null,null,{"$f":"ROUND((AL35/AM35),4)","v":{"$error":"#DIV/0!"}},{"$f":"(#REF!)","v":{"$error":"#REF!"}},null,null,null,null,null,null,{"$f":"ROUND((AT35/AU35),4)","v":{"$error":"#DIV/0!"}},{"$f":"(#REF!)","v":{"$error":"#REF!"}},null,null,null,null,null,{"$f":"ROUND((BA35/BB35),4)","v":{"$error":"#DIV/0!"}},{"$f":"(#REF!)","v":{"$error":"#REF!"}},null,null,null,null,null,null,{"$f":"ROUND((BI35/BJ35),4)","v":{"$error":"#DIV/0!"}},{"$f":"(#REF!)","v":{"$error":"#REF!"}}]
[null,null,{"$f":"ROUND((A36/B36),4)","v":{"$error":"#DIV/0!"}},{"$f":"(#REF!)","v":{"$error":"#REF!"}},null,null,null,null,null,{"$f":"ROUND((H36/I36),4)","v":{"$error":"#DIV/0!"}},{"$f":"(#REF!)","v":{"$error":"#REF!"}},null,null,null,null,null,null,{"$f":"ROUND((P36/Q36),4)","v":{"$error":"#DIV/0!"}},{"$f":"(#REF!)","v":{"$error":"#REF!"}},null,null,null,null,null,{"$f":"ROUND((W36/X36),4)","v":{"$error":"#DIV/0!"}},{"$f":"(#REF!)","v":{"$error":"#REF!"}},null,null,null,null,null,null,{"$f":"ROUND((AE36/AF36),4)","v":{"$error":"#DIV/0!"}},{"$f":"(#REF!)","v":{"$error":"#REF!"}},null,null,null,null,null,{"$f":"ROUND((AL36/AM36),4)","v":{"$error":"#DIV/0!"}},{"$f":"(#REF!)","v":{"$error":"#REF!"}},null,null,null,null,null,null,{"$f":"ROUND((AT36/AU36),4)","v":{"$error":"#DIV/0!"}},{"$f":"(#REF!)","v":{"$error":"#REF!"}},null,null,null,null,null,{"$f":"ROUND((BA36/BB36),4)","v":{"$error":"#DIV/0!"}},{"$f":"(#REF!)","v":{"$error":"#REF!"}},null,null,null,null,null,null,{"$f":"ROUND((BI36/BJ36),4)","v":{"$error":"#DIV/0!"}},{"$f":"(#REF!)","v":{"$error":"#REF!"}}]
[null,null,{"$error":"#DIV/0!"},{"$f":"(#REF!)","v":{"$error":"#REF!"}},null,null,null,null,null,{"$error":"#DIV/0!"},{"$f":"(#REF!)","v":{"$error":"#REF!"}},null,null,null,null,null,null,{"$error":"#DIV/0!"},{"$f":"(#REF!)","v":{"$error":"#REF!"}},null,null,null,null,null,{"$error":"#DIV/0!"},{"$f":"(#REF!)","v":{"$error":"#REF!"}},null,null,null,null,null,null,{"$error":"#DIV/0!"},{"$f":"(#REF!)","v":{"$error":"#REF!"}},null,null,null,null,null,{"$error":"#DIV/0!"},{"$f":"(#REF!)","v":{"$error":"#REF!"}},null,null,null,null,null,null,{"$error":"#DIV/0!"},{"$f":"(#REF!)","v":{"$error":"#REF!"}},null,null,null,null,null,{"$error":"#DIV/0!"},{"$f":"(#REF!)","v":{"$error":"#REF!"}},null,null,null,null,null,null,{"$error":"#DIV/0!"},{"$f":"(#REF!)","v":{"$error":"#REF!"}}]
[null,null,{"$error":"#DIV/0!"},{"$f":"(#REF!)","v":{"$error":"#REF!"}},null,null,null,null,null,{"$error":"#DIV/0!"},{"$f":"(#REF!)","v":{"$error":"#REF!"}},null,null,null,null,null,null,{"$error":"#DIV/0!"},{"$f":"(#REF!)","v":{"$error":"#REF!"}},null,null,null,null,null,{"$error":"#DIV/0!"},{"$f":"(#REF!)","v":{"$error":"#REF!"}},null,null,null,null,null,null,{"$error":"#DIV/0!"},{"$f":"(#REF!)","v":{"$error":"#REF!"}},null,null,null,null,null,{"$error":"#DIV/0!"},{"$f":"(#REF!)","v":{"$error":"#REF!"}},null,null,null,null,null,null,{"$error":"#DIV/0!"},{"$f":"(#REF!)","v":{"$error":"#REF!"}},null,null,null,null,null,{"$error":"#DIV/0!"},{"$f":"(#REF!)","v":{"$error":"#REF!"}},null,null,null,null,null,null,{"$error":"#DIV/0!"},{"$f":"(#REF!)","v":{"$error":"#REF!"}}]
[null,null,{"$error":"#DIV/0!"},{"$f":"(#REF!)","v":{"$error":"#REF!"}},null,null,null,null,null,{"$error":"#DIV/0!"},{"$f":"(#REF!)","v":{"$error":"#REF!"}},null,null,null,null,null,null,{"$error":"#DIV/0!"},{"$f":"(#REF!)","v":{"$error":"#REF!"}},null,null,null,null,null,{"$error":"#DIV/0!"},{"$f":"(#REF!)","v":{"$error":"#REF!"}},null,null,null,null,null,null,{"$error":"#DIV/0!"},{"$f":"(#REF!)","v":{"$error":"#REF!"}},null,null,null,null,null,{"$error":"#DIV/0!"},{"$f":"(#REF!)","v":{"$error":"#REF!"}},null,null,null,null,null,null,{"$error":"#DIV/0!"},{"$f":"(#REF!)","v":{"$error":"#REF!"}},null,null,null,null,null,{"$error":"#DIV/0!"},{"$f":"(#REF!)","v":{"$error":"#REF!"}},null,null,null,null,null,null,{"$error":"#DIV/0!"},{"$f":"(#REF!)","v":{"$error":"#REF!"}}]
[]
[null,null,null,null,null,null,null,null,null,null,null,"C. Unloading Procedures"]
[null,null,null,null,null,null,null,null,null,null,null,{"$f":"('Facility Cover Sheet'!A38)","v":{"$error":"#DIV/0!"}}]
[]
[]
["    TOTAL COUNT",null,null,null,null,null,null,"    TOTAL COUNT",null,null,null,null,null,null,null,"    TOTAL COUNT",null,null,null,null,null,null,"    TOTAL COUNT",null,null,null,null,null,null,null,"    TOTAL COUNT",null,null,null,null,null,null,"    TOTAL COUNT",null,null,null,null,null,null,null,"    TOTAL COUNT",null,null,null,null,null,null,"    TOTAL COUNT",null,null,null,null,null,null,null,"    TOTAL COUNT"]
[{"$f":"SUM(A35:A44)","v":0},{"$f":"SUM(B35:B44)","v":0},null,null,null,null,null,{"$f":"SUM(H35:H44)","v":0},{"$f":"SUM(I35:I44)","v":0},null,null,null,null,null,null,{"$f":"SUM(P35:P44)","v":0},{"$f":"SUM(Q35:Q44)","v":0},null,null,null,null,null,{"$f":"SUM(W35:W44)","v":0},{"$f":"SUM(X35:X44)","v":0},null,null,null,null,null,null,{"$f":"SUM(AE35:AE44)","v":0},{"$f":"SUM(AF35:AF44)","v":0},null,null,null,null,null,{"$f":"SUM(AL35:AL44)","v":0},{"$f":"SUM(AM35:AM44)","v":0},null,null,null,null,null,null,{"$f":"SUM(AT35:AT44)","v":0},{"$f":"SUM(AU35:AU44)","v":0},null,null,null,null,null,{"$f":"SUM(BA35:BA44)","v":0},{"$f":"SUM(BB35:BB44)","v":0},null,null,null,null,null,null,{"$f":"SUM(BI35:BI44)","v":0},{"$f":"SUM(BJ35:BJ44)","v":0}]
[]
[" TOTAL PERCENTAGE",null,null,null,null,null,null," TOTAL PERCENTAGE",null,null,null,null,null,null,null," TOTAL PERCENTAGE",null,null,null,null,null,null," TOTAL PERCENTAGE",null,null,null,null,null,null,null," TOTAL PERCENTAGE",null,null,null,null,null,null," TOTAL PERCENTAGE",null,null,null,null,null,null,null," TOTAL PERCENTAGE",null,null,null,null,null,null," TOTAL PERCENTAGE",null,null,null,null,null,null,null," TOTAL PERCENTAGE"]
[{"$f":"IF(ROUND((C49),4)<=0.9943,ROUND((C49),4),IF((C49)<1,0.99,IF((C49)=1,1,(C48))))","v":{"$error":"#DIV/0!"}},null,{"$f":"ROUND(SUM(A35:A44)/SUM(B35:B44),4)","v":{"$error":"#DIV/0!"}},null,null,null,null,{"$f":"IF(ROUND((J49),4)<=0.9943,ROUND((J49),4),IF((J49)<1,0.99,IF((J49)=1,1,(J48))))","v":{"$error":"#DIV/0!"}},null,{"$f":"ROUND(SUM(H35:H44)/SUM(I35:I44),4)","v":{"$error":"#DIV/0!"}},null,null,null,null,null,{"$f":"IF(ROUND((R49),4)<=0.9943,ROUND((R49),4),IF((R49)<1,0.99,IF((R49)=1,1,(R48))))","v":{"$error":"#DIV/0!"}},null,{"$f":"ROUND(SUM(P35:P44)/SUM(Q35:Q44),4)","v":{"$error":"#DIV/0!"}},null,null,null,null,{"$f":"IF(ROUND((Y49),4)<=0.9943,ROUND((Y49),4),IF((Y49)<1,0.99,IF((Y49)=1,1,(Y48))))","v":{"$error":"#DIV/0!"}},null,{"$f":"ROUND(SUM(W35:W44)/SUM(X35:X44),4)","v":{"$error":"#DIV/0!"}},null,null,null,null,null,{"$f":"IF(ROUND((AG49),4)<=0.9943,ROUND((AG49),4),IF((AG49)<1,0.99,IF((AG49)=1,1,(AG48))))","v":{"$error":"#DIV/0!"}},null,{"$f":"ROUND(SUM(AE35:AE44)/SUM(AF35:AF44),4)","v":{"$error":"#DIV/0!"}},null,null,null,null,{"$f":"IF(ROUND((AN49),4)<=0.9943,ROUND((AN49),4),IF((AN49)<1,0.99,IF((AN49)=1,1,(AN48))))","v":{"$error":"#DIV/0!"}},null,{"$f":"ROUND(SUM(AL35:AL44)/SUM(AM35:AM44),4)","v":{"$error":"#DIV/0!"}},null,null,null,null,null,{"$f":"IF(ROUND((AV49),4)<=0.9943,ROUND((AV49),4),IF((AV49)<1,0.99,IF((AV49)=1,1,(AV48))))","v":{"$error":"#DIV/0!"}},null,{"$f":"ROUND(SUM(AT35:AT44)/SUM(AU35:AU44),4)","v":{"$error":"#DIV/0!"}},null,null,null,null,{"$f":"IF(ROUND((BC49),4)<=0.9943,ROUND((BC49),4),IF((BC49)<1,0.99,IF((BC49)=1,1,(BC48))))","v":{"$error":"#DIV/0!"}},null,{"$f":"ROUND(SUM(BA35:BA44)/SUM(BB35:BB44),4)","v":{"$error":"#DIV/0!"}},null,null,null,null,null,{"$f":"IF(ROUND((BK49),4)<=0.9943,ROUND((BK49),4),IF((BK49)<1,0.99,IF((BK49)=1,1,(BK48))))","v":{"$error":"#DIV/0!"}},null,{"$f":"ROUND(SUM(BI35:BI44)/SUM(BJ35:BJ44),4)","v":{"$error":"#DIV/0!"}}]
["  E1 VEHICLE SECURITY INSPECTION-UPON EXIT",null,null,null,null,null,null,"  E2 GATES CLOSED AND LOCKED WHEN NOT IN USE",null,null,null,null,null,null,null,"  E3  PAVEMENT CONDITION",null,null,null,null,null,null,"  E4 STORAGE AREA CLEAN",null,null,null,null,null,null,null,"  E5 UNLOADING RAMP CONDITION",null,null,null,null,null,null,"  E6 PROTECTIVE COATING ON TOOL HANDLES",null,null,null,null,null,null,null,"  E7 Is AAR/TTCI Website Used"]
[null,null,{"$f":"ROUND((A51/B51),4)","v":{"$error":"#DIV/0!"}},{"$f":"(#REF!)","v":{"$error":"#REF!"}},null,null,null,null,null,{"$f":"ROUND((H51/I51),4)","v":{"$error":"#DIV/0!"}},{"$f":"(#REF!)","v":{"$error":"#REF!"}},null,null,null,null,null,null,{"$f":"ROUND((P51/Q51),4)","v":{"$error":"#DIV/0!"}},{"$f":"(#REF!)","v":{"$error":"#REF!"}},null,null,null,null,null,{"$f":"ROUND((W51/X51),4)","v":{"$error":"#DIV/0!"}},{"$f":"(#REF!)","v":{"$error":"#REF!"}},null,null,null,null,null,null,{"$f":"ROUND((AE51/AF51),4)","v":{"$error":"#DIV/0!"}},{"$f":"(#REF!)","v":{"$error":"#REF!"}},null,null,null,null,null,{"$f":"ROUND((AL51/AM51),4)","v":{"$error":"#DIV/0!"}},{"$f":"(#REF!)","v":{"$error":"#REF!"}},null,null,null,null,null,null,{"$f":"ROUND((AT51/AU51),4)","v":{"$error":"#DIV/0!"}},{"$f":"(#REF!)","v":{"$error":"#REF!"}},null,null,null," "," "," "]
[null,null,{"$f":"ROUND((A52/B52),4)","v":{"$error":"#DIV/0!"}},{"$f":"(#REF!)","v":{"$error":"#REF!"}},null,null,null,null,null,{"$f":"ROUND((H52/I52),4)","v":{"$error":"#DIV/0!"}},{"$f":"(#REF!)","v":{"$error":"#REF!"}},null,null,null,null,null,null,{"$f":"ROUND((P52/Q52),4)","v":{"$error":"#DIV/0!"}},{"$f":"(#REF!)","v":{"$error":"#REF!"}},null,null,null,null,null,{"$f":"ROUND((W52/X52),4)","v":{"$error":"#DIV/0!"}},{"$f":"(#REF!)","v":{"$error":"#REF!"}},null,null,null,null,null,null,{"$f":"ROUND((AE52/AF52),4)","v":{"$error":"#DIV/0!"}},{"$f":"(#REF!)","v":{"$error":"#REF!"}},null,null,null,null,null,{"$f":"ROUND((AL52/AM52),4)","v":{"$error":"#DIV/0!"}},{"$f":"(#REF!)","v":{"$error":"#REF!"}},null,null,null,null,null,null,{"$f":"ROUND((AT52/AU52),4)","v":{"$error":"#DIV/0!"}},{"$f":"(#REF!)","v":{"$error":"#REF!"}}]
[null,null,{"$error":"#DIV/0!"},{"$f":"(#REF!)","v":{"$error":"#REF!"}},null,null,null,null,null,{"$error":"#DIV/0!"},{"$f":"(#REF!)","v":{"$error":"#REF!"}},null,null,null,null,null,null,{"$error":"#DIV/0!"},{"$f":"(#REF!)","v":{"$error":"#REF!"}},null,null,null,null,null,{"$error":"#DIV/0!"},{"$f":"(#REF!)","v":{"$error":"#REF!"}},null,null,null,null,null,null,{"$error":"#DIV/0!"},{"$f":"(#REF!)","v":{"$error":"#REF!"}},null,null,null,null,null,{"$error":"#DIV/0!"},{"$f":"(#REF!)","v":{"$error":"#REF!"}},null,null,null,null,null,null,{"$error":"#DIV/0!"},{"$f":"(#REF!)","v":{"$error":"#REF!"}}]
[null,null,{"$error":"#DIV/0!"},{"$f":"(#REF!)","v":{"$error":"#REF!"}},null,null,null,null,null,{"$error":"#DIV/0!"},{"$f":"(#REF!)","v":{"$error":"#REF!"}},null,null,null,null,null,null,{"$error":"#DIV/0!"},{"$f":"(#REF!)","v":{"$error":"#REF!"}},null,null,null,null,null,{"$error":"#DIV/0!"},{"$f":"(#REF!)","v":{"$error":"#REF!"}},null,null,null,null,null,null,{"$error":"#DIV/0!"},{"$f":"(#REF!)","v":{"$error":"#REF!"}},null,null,null,null,null,{"$error":"#DIV/0!"},{"$f":"(#REF!)","v":{"$error":"#REF!"}},null,null,null,null,null,null,{"$error":"#DIV/0!"},{"$f":"(#REF!)","v":{"$error":"#REF!"}}]
[null,null,{"$error":"#DIV/0!"},{"$f":"(#REF!)","v":{"$error":"#REF!"}},null,null,null,null,null,{"$error":"#DIV/0!"},{"$f":"(#REF!)","v":{"$error":"#REF!"}},null,null,null,null,null,null,{"$error":"#DIV/0!"},{"$f":"(#REF!)","v":{"$error":"#REF!"}},null,null,null,null,null,{"$error":"#DIV/0!"},{"$f":"(#REF!)","v":{"$error":"#REF!"}},null,null,null,null,null,null,{"$error":"#DIV/0!"},{"$f":"(#REF!)","v":{"$error":"#REF!"}},null,null,null,null,null,{"$error":"#DIV/0!"},{"$f":"(#REF!)","v":{"$error":"#REF!"}},null,null,null,null,null,null,{"$error":"#DIV/0!"},{"$f":"(#REF!)","v":{"$error":"#REF!"}},"E. Facility Procedures/Conditions"]
[null,null,null,null,null,null,null,null,null,null,null,null,null,null,null,null,null,null,null,null,null,null,null,null,null,null,null,null,null,null,null,null,null,null,null,null,null,null,null,null,null,null,null,null,null,null,null,null,null,{"$f":"('Facility Cover Sheet'!G36)","v":{"$error":"#DIV/0!"}}]
[null,null,null,null,"D. Baying Procedures"]
[null,null,null,null,{"$f":"('Facility Cover Sheet'!G22)","v":{"$error":"#DIV/0!"}},null,null,null,null,null,null,null,null,null,null,null,null,null,null,null,null,null,null,null,null,null,null,null,null,null,null,null,null,null,null,null,null,null,null,null,null,null,null,null,null,null,null,null,null,"OVERALL SCORE"]
[null,null,null,null,null,null,null,null,null,null,null,null,null,null,null,null,null,null,null,null,null,null,null,null,null,null,null,null,null,null,null,null,null,null,null,null,null,null,null,null,null,null,null,null,null,null,null,null,null,{"$f":"('Facility Cover Sheet'!E2)","v":{"$error":"#DIV/0!"}}]
[]
["    TOTAL COUNT",null,null,null,null,null,null,"    TOTAL COUNT",null,null,null,null,null,null,null,"    TOTAL COUNT",null,null,null,null,null,null,"    TOTAL COUNT",null,null,null,null,null,null,null,"    TOTAL COUNT",null,null,null,null,null,null,"    TOTAL COUNT",null,null,null,null,null,null,null,"    TOTAL COUNT",null,null,null,null,null,null,"    TOTAL COUNT"]
[{"$f":"SUM(A51:A60)","v":0},{"$f":"SUM(B51:B60)","v":0},null,null,null,null,null,{"$f":"SUM(H51:H60)","v":0},{"$f":"SUM(I51:I60)","v":0},null,null,null,null,null,null,{"$f":"SUM(P51:P60)","v":0},{"$f":"SUM(Q51:Q60)","v":0},null,null,null,null,null,{"$f":"SUM(W51:W60)","v":0},{"$f":"SUM(X51:X60)","v":0},null,null,null,null,null,null,{"$f":"SUM(AE51:AE60)","v":0},{"$f":"SUM(AF51:AF60)","v":0},null,null,null,null,null,{"$f":"SUM(AL51:AL60)","v":0},{"$f":"SUM(AM51:AM60)","v":0},null,null,null,null,null,null,{"$f":"SUM(AT51:AT60)","v":0},{"$f":"SUM(AU51:AU60)","v":0},null,null,null,null,null,{"$f":"SUM(BA51:BA60)","v":0},{"$f":"SUM(BB51:BB60)","v":0}]
[]
[" TOTAL PERCENTAGE",null,null,null,null,null,null," TOTAL PERCENTAGE",null,null,null,null,null,null,null," TOTAL PERCENTAGE",null,null,null,null,null,null," TOTAL PERCENTAGE",null,null,null,null,null,null,null," TOTAL PERCENTAGE",null,null,null,null,null,null," TOTAL PERCENTAGE",null,null,null,null,null,null,null," TOTAL PERCENTAGE",null,null,null,null,null,null," TOTAL PERCENTAGE"]
[{"$f":"IF(ROUND((C65),4)<=0.9943,ROUND((C65),4),IF((C65)<1,0.99,IF((C65)=1,1,(C64))))","v":{"$error":"#DIV/0!"}},null,{"$f":"ROUND(SUM(A51:A60)/SUM(B51:B60),4)","v":{"$error":"#DIV/0!"}},null,null,null,null,{"$f":"IF(ROUND((J65),4)<=0.9943,ROUND((J65),4),IF((J65)<1,0.99,IF((J65)=1,1,(J64))))","v":{"$error":"#DIV/0!"}},null,{"$f":"ROUND(SUM(H51:H60)/SUM(I51:I60),4)","v":{"$error":"#DIV/0!"}},null,null,null,null,null,{"$f":"IF(ROUND((R65),4)<=0.9943,ROUND((R65),4),IF((R65)<1,0.99,IF((R65)=1,1,(R64))))","v":{"$error":"#DIV/0!"}},null,{"$f":"ROUND(SUM(P51:P60)/SUM(Q51:Q60),4)","v":{"$error":"#DIV/0!"}},null,null,null,null,{"$f":"IF(ROUND((Y65),4)<=0.9943,ROUND((Y65),4),IF((Y65)<1,0.99,IF((Y65)=1,1,(Y64))))","v":{"$error":"#DIV/0!"}},null,{"$f":"ROUND(SUM(W51:W60)/SUM(X51:X60),4)","v":{"$error":"#DIV/0!"}},null,null,null,null,null,{"$f":"IF(ROUND((AG65),4)<=0.9943,ROUND((AG65),4),IF((AG65)<1,0.99,IF((AG65)=1,1,(AG64))))","v":{"$error":"#DIV/0!"}},null,{"$f":"ROUND(SUM(AE51:AE60)/SUM(AF51:AF60),4)","v":{"$error":"#DIV/0!"}},null,null,null,null,{"$f":"IF(ROUND((AN65),4)<=0.9943,ROUND((AN65),4),IF((AN65)<1,0.99,IF((AN65)=1,1,(AN64))))","v":{"$error":"#DIV/0!"}},null,{"$f":"ROUND(SUM(AL51:AL60)/SUM(AM51:AM60),4)","v":{"$error":"#DIV/0!"}},null,null,null,null,null,{"$f":"IF(ROUND((AV65),4)<=0.9943,ROUND((AV65),4),IF((AV65)<1,0.99,IF((AV65)=1,1,(AV64))))","v":{"$error":"#DIV/0!"}},null,{"$f":"ROUND(SUM(AT51:AT60)/SUM(AU51:AU60),4)","v":{"$error":"#DIV/0!"}},null,null,null,null,{"$f":"IF(ROUND((BC65),4)<=0.9943,ROUND((BC65),4),IF((BC65)<1,0.99,IF((BC65)=1,1,(BC64))))","v":{"$error":"#DIV/0!"}},null,{"$f":"ROUND(SUM(BA51:BA60)/SUM(BB51:BB60),4)","v":{"$error":"#DIV/0!"}}]

{"sheet":"US. Speed Sheet","index":5,"n_rows":55,"n_cols":8,"rows_kept":55,"cut":false,"hidden":false,"merged":[[4,0,5,0]]}
[]
["SPEEDS OF VEHICLES THROUGH RAIL CARS AND STORAGE/RAMP AREA"]
[]
["Ramp Code: ",{"$f":"'Facility Cover Sheet'!I5","v":0},"Date: ",{"$f":"'Facility Cover Sheet'!H3","v":"00:00:00"}]
["Multi-Level Speeds ="]
[null,5,"Bay Speeds =",15]
[]
["Through RailCars (5mph)",null,"Storage and Ramp (15mph)"]
["Time Sec.","Speed (mph)","Time Sec.","Speed (mph)"]
[null,{"$f":"IF((A10)=0,\"NA\",ROUNDDOWN(61/A10,0))","v":"NA"},null,{"$f":"IF((C10)=0,\"NA\",ROUNDDOWN(61/C10,0))","v":"NA"},null,{"$f":"IF((B10)>B6,(B10),(\"ERR\"))","v":"NA"},null,{"$f":"IF((D10)>D6,(D10),(\"ERR\"))","v":"NA"}]
[null,{"$f":"IF((A11)=0,\"NA\",ROUNDDOWN(61/A11,0))","v":"NA"},null,{"$f":"IF((C11)=0,\"NA\",ROUNDDOWN(61/C11,0))","v":"NA"},null,{"$f":"IF((B11)>B6,(B11),(\"ERR\"))","v":"NA"},null,{"$f":"IF((D11)>D6,(D11),(\"ERR\"))","v":"NA"}]
[null,"NA",null,"NA",null,{"$f":"IF((B12)>B6,(B12),(\"ERR\"))","v":"NA"},null,{"$f":"IF((D12)>D6,(D12),(\"ERR\"))","v":"NA"}]
[null,"NA",null,"NA",null,{"$f":"IF((B13)>B6,(B13),(\"ERR\"))","v":"NA"},null,{"$f":"IF((D13)>D6,(D13),(\"ERR\"))","v":"NA"}]
[null,"NA",null,"NA",null,{"$f":"IF((B14)>B6,(B14),(\"ERR\"))","v":"NA"},null,{"$f":"IF((D14)>D6,(D14),(\"ERR\"))","v":"NA"}]
[null,"NA",null,"NA",null,{"$f":"IF((B15)>B6,(B15),(\"ERR\"))","v":"NA"},null,{"$f":"IF((D15)>D6,(D15),(\"ERR\"))","v":"NA"}]
[null,"NA",null,"NA",null,{"$f":"IF((B16)>B6,(B16),(\"ERR\"))","v":"NA"},null,{"$f":"IF((D16)>D6,(D16),(\"ERR\"))","v":"NA"}]
[null,"NA",null,"NA",null,{"$f":"IF((B17)>B6,(B17),(\"ERR\"))","v":"NA"},null,{"$f":"IF((D17)>D6,(D17),(\"ERR\"))","v":"NA"}]
[null,"NA",null,"NA",null,{"$f":"IF((B18)>B6,(B18),(\"ERR\"))","v":"NA"},null,{"$f":"IF((D18)>D6,(D18),(\"ERR\"))","v":"NA"}]
[null,"NA",null,"NA",null,{"$f":"IF((B19)>B6,(B19),(\"ERR\"))","v":"NA"},null,{"$f":"IF((D19)>D6,(D19),(\"ERR\"))","v":"NA"}]
[null,"NA",null,"NA",null,{"$f":"IF((B20)>B6,(B20),(\"ERR\"))","v":"NA"},null,{"$f":"IF((D20)>D6,(D20),(\"ERR\"))","v":"NA"}]
[null,"NA",null,"NA",null,{"$f":"IF((B21)>B6,(B21),(\"ERR\"))","v":"NA"},null,{"$f":"IF((D21)>D6,(D21),(\"ERR\"))","v":"NA"}]
[null,"NA",null,"NA",null,{"$f":"IF((B22)>B6,(B22),(\"ERR\"))","v":"NA"},null,{"$f":"IF((D22)>D6,(D22),(\"ERR\"))","v":"NA"}]
[null,"NA",null,"NA",null,{"$f":"IF((B23)>B6,(B23),(\"ERR\"))","v":"NA"},null,{"$f":"IF((D23)>D6,(D23),(\"ERR\"))","v":"NA"}]
[null,"NA",null,"NA",null,{"$f":"IF((B24)>B6,(B24),(\"ERR\"))","v":"NA"},null,{"$f":"IF((D24)>D6,(D24),(\"ERR\"))","v":"NA"}]
[null,"NA",null,"NA",null,{"$f":"IF((B25)>B6,(B25),(\"ERR\"))","v":"NA"},null,{"$f":"IF((D25)>D6,(D25),(\"ERR\"))","v":"NA"}]
[null,"NA",null,"NA",null,{"$f":"IF((B26)>B6,(B26),(\"ERR\"))","v":"NA"},null,{"$f":"IF((D26)>D6,(D26),(\"ERR\"))","v":"NA"}]
[null,"NA",null,"NA",null,{"$f":"IF((B27)>B6,(B27),(\"ERR\"))","v":"NA"},null,{"$f":"IF((D27)>D6,(D27),(\"ERR\"))","v":"NA"}]
[null,"NA",null,"NA",null,{"$f":"IF((B28)>B6,(B28),(\"ERR\"))","v":"NA"},null,{"$f":"IF((D28)>D6,(D28),(\"ERR\"))","v":"NA"}]
[null,"NA",null,"NA",null,{"$f":"IF((B29)>B6,(B29),(\"ERR\"))","v":"NA"},null,{"$f":"IF((D29)>D6,(D29),(\"ERR\"))","v":"NA"}]
[null,"NA",null,"NA",null,{"$f":"IF((B30)>B6,(B30),(\"ERR\"))","v":"NA"},null,{"$f":"IF((D30)>D6,(D30),(\"ERR\"))","v":"NA"}]
[null,"NA",null,"NA",null,{"$f":"IF((B31)>B6,(B31),(\"ERR\"))","v":"NA"},null,{"$f":"IF((D31)>D6,(D31),(\"ERR\"))","v":"NA"}]
[null,"NA",null,"NA",null,{"$f":"IF((B32)>B6,(B32),(\"ERR\"))","v":"NA"},null,{"$f":"IF((D32)>D6,(D32),(\"ERR\"))","v":"NA"}]
[null,"NA",null,"NA",null,{"$f":"IF((B33)>B6,(B33),(\"ERR\"))","v":"NA"},null,{"$f":"IF((D33)>D6,(D33),(\"ERR\"))","v":"NA"}]
[null,"NA",null,"NA",null,{"$f":"IF((B34)>B6,(B34),(\"ERR\"))","v":"NA"},null,{"$f":"IF((D34)>D6,(D34),(\"ERR\"))","v":"NA"}]
[null,"NA",null,"NA",null,{"$f":"IF((B35)>B6,(B35),(\"ERR\"))","v":"NA"},null,{"$f":"IF((D35)>D6,(D35),(\"ERR\"))","v":"NA"}]
[null,"NA",null,"NA",null,{"$f":"IF((B36)>B6,(B36),(\"ERR\"))","v":"NA"},null,{"$f":"IF((D36)>D6,(D36),(\"ERR\"))","v":"NA"}]
[null,"NA",null,"NA",null,{"$f":"IF((B37)>B6,(B37),(\"ERR\"))","v":"NA"},null,{"$f":"IF((D37)>D6,(D37),(\"ERR\"))","v":"NA"}]
[null,"NA",null,"NA",null,{"$f":"IF((B38)>B6,(B38),(\"ERR\"))","v":"NA"},null,{"$f":"IF((D38)>D6,(D38),(\"ERR\"))","v":"NA"}]
[null,"NA",null,"NA",null,{"$f":"IF((B39)>B6,(B39),(\"ERR\"))","v":"NA"},null,{"$f":"IF((D39)>D6,(D39),(\"ERR\"))","v":"NA"}]
[null,"NA",null,"NA",null,{"$f":"IF((B40)>B6,(B40),(\"ERR\"))","v":"NA"},null,{"$f":"IF((D40)>D6,(D40),(\"ERR\"))","v":"NA"}]
[null,"NA",null,"NA",null,{"$f":"IF((B41)>B6,(B41),(\"ERR\"))","v":"NA"},null,{"$f":"IF((D41)>D6,(D41),(\"ERR\"))","v":"NA"}]
[null,"NA",null,"NA",null,{"$f":"IF((B42)>B6,(B42),(\"ERR\"))","v":"NA"},null,{"$f":"IF((D42)>D6,(D42),(\"ERR\"))","v":"NA"}]
[null,"NA",null,"NA",null,{"$f":"IF((B43)>B6,(B43),(\"ERR\"))","v":"NA"},null,{"$f":"IF((D43)>D6,(D43),(\"ERR\"))","v":"NA"}]
[null,"NA",null,"NA",null,{"$f":"IF((B44)>B6,(B44),(\"ERR\"))","v":"NA"},null,{"$f":"IF((D44)>D6,(D44),(\"ERR\"))","v":"NA"}]
[]
["High Speed",{"$f":"MAX(B10:B44)","v":0},"High Speed",{"$f":"MAX(D10:D44)","v":0}]
["Low  Speed",{"$f":"MIN(B10:B44)","v":0},"Low  Speed",{"$f":"MIN(D10:D44)","v":0}]
["Avg  Speed",{"$f":"AVERAGE(B10:B44)","v":{"$error":"#DIV/0!"}},"Avg  Speed",{"$f":"AVERAGE(D10:D44)","v":{"$error":"#DIV/0!"}},null,{"$f":"(COUNT(F10:F44))","v":0},null,{"$f":"(COUNT(H10:H44))","v":0}]
[]
["Total Count",{"$f":"COUNTA(A10:A44)","v":0},"Total Count",{"$f":"COUNTA(C10:C44)","v":0},null,{"$f":"(COUNTA(A10:A44))-(F48)","v":0},null,{"$f":"(COUNTA(C10:C44))-(H48)","v":0}]
[]
["Total Under",null,"Total Under"]
["5 MPH",{"$f":"(F50)","v":0},"15 MPH",{"$f":"(H50)","v":0}]
[]
["Percentage",{"$f":"((B53)/(B50))","v":{"$error":"#DIV/0!"}},"Percentage",{"$f":"((D53)/(D50))","v":{"$error":"#DIV/0!"}}]